program: Orca
programVersion: 4.2.1
elementType: Cl O N N N C C C C C C C C C C C C C C C C C C H H H H H H H H H H H H H H H H H H H H H H H H
charge: 0
multiplicity: 1
keywords: wb97x-d3
keywords: def2-TZVPP
keywords: def2/J RIJCOSX GRIDX6 NOFINALGRIDX
keywords: grid4 nofinalgrid
keywords: scfconv7
keywords: smallprint printgap noloewdin
keywords: NOSOSCF
formula: C18H24ClN3O
InChI: InChI=1/C18H24ClN3O/c1-13(2)17-8-5-15(9-14-3-6-16(19)7-4-14)18(17,23)10-22-12-20-11-21-22/h3-4,6-7,11-13,15,17,23H,5,8-10H2,1-2H3
47 atoms
Cl 5.255139 3.059314 -1.330018
O  -2.214517 0.180664 2.02898
N  -0.829009 -2.868163 0.507687
N  -1.446555 -3.547626 -0.461664
N  0.765173 -3.914713 -0.541365
C  -1.794254 -0.563174 0.901807
C  -2.810469 -0.522063 -0.275816
C  -0.554231 0.146066 0.338138
C  -2.299852 0.582798 -1.230685
C  -1.155171 1.273693 -0.493502
C  -4.292175 -0.405311 0.132458
C  -1.522351 -1.989402 1.421437
C  0.48254 0.576564 1.375403
C  -4.762595 1.010077 0.47149
C  -5.177985 -0.976156 -0.971746
C  1.687129 1.195274 0.725309
C  0.483086 -3.096523 0.442945
C  2.644983 0.403996 0.095212
C  1.858622 2.575985 0.701995
C  3.742724 0.965404 -0.538419
C  2.949554 3.159001 0.073201
C  -0.453104 -4.154732 -1.058736
C  3.884636 2.34448 -0.543427
H  -2.720085 -1.480235 -0.792171
H  -0.069883 -0.543627 -0.364716
H  -3.078514 1.281436 -1.536164
H  -1.918682 0.128498 -2.147294
H  -0.431989 1.728579 -1.171214
H  -1.52879 2.067465 0.159814
H  -4.453098 -1.039307 1.015748
H  -2.461092 -2.471017 1.701221
H  -0.914961 -1.93163 2.32521
H  0.797302 -0.284466 1.973251
H  0.040704 1.291057 2.071218
H  -3.080971 -0.131951 2.311356
H  -4.830418 1.631756 -0.423082
H  -5.76214 0.978659 0.908349
H  -4.112926 1.525532 1.176624
H  -6.235276 -0.892784 -0.713121
H  -4.964224 -2.030756 -1.153425
H  -5.028644 -0.440976 -1.912756
H  1.186606 -2.672928 1.14284
H  2.542315 -0.675128 0.096762
H  1.128933 3.215108 1.183966
H  4.477448 0.333449 -1.018369
H  3.064691 4.234334 0.068281
H  -0.616394 -4.807442 -1.901703
elementType: Cl O N C H
totalener: -1400.15693539 hartree
nucrepener: 2115.59212806 hartree
electener: -3515.74906345 hartree
oneelecener: -6115.17328035 hartree
twoeener: 2599.42421690 hartree
cpcmener: -0.03028233 hartree
kineticenergy: 1395.26897583 hartree
xcener: -114.439414802379 hartree
chargesum: -0.0000000
charge: -0.107619 -0.429861 0.125401 -0.370147 -0.420217 0.426506 -0.087503 -0.015735 -0.175259 -0.233092 0.005168 -0.199258 -0.151439 -0.303458 -0.302819 0.055068 0.051580 -0.225434 -0.214025 -0.170869 -0.146378 0.075902 0.096865 0.079517 0.096313 0.091034 0.090731 0.085891 0.081992 0.036817 0.134202 0.135309 0.112534 0.093498 0.220268 0.080077 0.101691 0.091647 0.093892 0.086164 0.087615 0.178054 0.148933 0.139424 0.143879 0.143721 0.163417
qa: -0.1076 -0.4299 0.1254 -0.3701 -0.4202 0.4265 -0.0875 -0.0157 -0.1753 -0.2331 0.0052 -0.1993 -0.1514 -0.3035 -0.3028 0.0551 0.0516 -0.2254 -0.2140 -0.1709 -0.1464 0.0759 0.0969 0.0795 0.0963 0.0910 0.0907 0.0859 0.0820 0.0368 0.1342 0.1353 0.1125 0.0935 0.2203 0.0801 0.1017 0.0916 0.0939 0.0862 0.0876 0.1781 0.1489 0.1394 0.1439 0.1437 0.1634
va: 1.1977 2.0217 3.3175 2.8589 3.0172 3.8469 3.8242 3.6918 3.9516 4.0393 3.8799 3.8914 3.8101 3.9012 3.9287 3.4424 4.0535 3.9890 3.9823 4.0387 3.9815 4.0222 3.8070 1.0368 1.0135 1.0088 1.0046 1.0133 1.0126 1.0210 1.0075 1.0045 1.0092 1.0373 1.0155 1.0014 1.0038 1.0260 1.0032 1.0083 1.0010 0.9901 0.9982 1.0068 1.0072 1.0049 0.9937
dispcorr: -0.027242495 hartree
energy: -1400.184177880935
dipole: -43.99185 42.21093 -1.78091 -4.83167 4.91213 0.08046 4.61378 -3.28356 1.33021
magnitude: 2.22432 au
magnitude: 5.65377 debye
