program: Orca
programVersion: 4.2.1
elementType: Cl O N N N C C C C C C C C C C C C C C C C C C H H H H H H H H H H H H H H H H H H H H H H H H
charge: 0
multiplicity: 1
keywords: wb97x-d3
keywords: def2-TZVPP
keywords: def2/J RIJCOSX GRIDX6 NOFINALGRIDX
keywords: grid4 nofinalgrid
keywords: scfconv7
keywords: smallprint printgap noloewdin
keywords: NOSOSCF
formula: C18H24ClN3O
InChI: InChI=1/C18H24ClN3O/c1-13(2)17-8-5-15(9-14-3-6-16(19)7-4-14)18(17,23)10-22-12-20-11-21-22/h3-4,6-7,11-13,15,17,23H,5,8-10H2,1-2H3
47 atoms
Cl 5.36913 2.95652 -0.979565
O  -1.989939 -0.935666 1.615467
N  -0.795365 -2.872278 -0.260789
N  -0.435212 -3.203572 0.984921
N  1.125838 -3.870418 -0.474109
C  -1.937933 -0.72666 0.222058
C  -3.162302 0.142733 -0.200284
C  -0.67033 0.085519 -0.227593
C  -2.577028 1.53903 -0.413066
C  -1.226528 1.254687 -1.044353
C  -4.390556 0.104486 0.716532
C  -1.975818 -2.072883 -0.519109
C  0.193674 0.556294 0.950314
C  -5.447924 1.089434 0.219935
C  -5.01466 -1.283957 0.819864
C  1.4839 1.167196 0.483845
C  0.14985 -3.264235 -1.111708
C  2.508269 0.357417 -0.00447
C  1.692367 2.542639 0.508664
C  3.702643 0.895423 -0.455952
C  2.881116 3.103072 0.060874
C  0.71955 -3.796389 0.803865
C  3.877639 2.2709 -0.419643
H  -3.488166 -0.216059 -1.187165
H  -0.031483 -0.532532 -0.865834
H  -2.458384 2.055475 0.546041
H  -3.207261 2.168741 -1.041091
H  -1.368983 0.950781 -2.085011
H  -0.55951 2.118479 -1.060894
H  -4.088512 0.423679 1.718654
H  -2.014013 -1.909358 -1.595048
H  -2.858883 -2.649505 -0.241936
H  0.432486 -0.288392 1.600116
H  -0.353758 1.275254 1.56382
H  -1.375396 -1.649228 1.84457
H  -5.746771 0.86576 -0.807659
H  -6.344946 1.03504 0.839617
H  -5.102115 2.123003 0.246307
H  -4.344801 -2.013247 1.272123
H  -5.307036 -1.658102 -0.164791
H  -5.916494 -1.254328 1.434726
H  0.083614 -3.099388 -2.175461
H  2.378699 -0.719201 -0.028973
H  0.917869 3.197218 0.889472
H  4.486789 0.249366 -0.826491
H  3.022858 4.174851 0.090894
H  1.28469 -4.195996 1.6309
elementType: Cl O N C H
totalener: -1400.15956078 hartree
nucrepener: 2118.96629217 hartree
electener: -3519.12585295 hartree
oneelecener: -6122.02680876 hartree
twoeener: 2602.90095581 hartree
cpcmener: -0.02840242 hartree
kineticenergy: 1395.26352289 hartree
xcener: -114.441196836996 hartree
chargesum: 0.0000000
charge: -0.107769 -0.453905 0.129394 -0.384123 -0.413963 0.297409 -0.025946 0.024059 -0.201049 -0.213791 0.086948 -0.173720 -0.099168 -0.312930 -0.341675 0.059874 0.058720 -0.230613 -0.246318 -0.165615 -0.145292 0.081224 0.092632 0.081121 0.079481 0.080350 0.083024 0.089537 0.091100 0.024663 0.116739 0.157746 0.098245 0.101958 0.221962 0.086784 0.091352 0.093334 0.087654 0.090041 0.095796 0.181459 0.136283 0.144649 0.143360 0.144731 0.164246
qa: -0.1078 -0.4539 0.1294 -0.3841 -0.4140 0.2974 -0.0259 0.0241 -0.2010 -0.2138 0.0869 -0.1737 -0.0992 -0.3129 -0.3417 0.0599 0.0587 -0.2306 -0.2463 -0.1656 -0.1453 0.0812 0.0926 0.0811 0.0795 0.0804 0.0830 0.0895 0.0911 0.0247 0.1167 0.1577 0.0982 0.1020 0.2220 0.0868 0.0914 0.0933 0.0877 0.0900 0.0958 0.1815 0.1363 0.1446 0.1434 0.1447 0.1642
va: 1.1978 1.9637 3.3173 2.8507 2.9961 3.8495 3.7912 3.8265 3.9692 4.0032 3.7728 3.9620 3.7306 3.9407 3.9337 3.4576 4.0361 3.9935 3.9764 4.0230 3.9756 4.0071 3.8100 1.0140 1.0190 1.0043 1.0132 1.0060 1.0119 1.0347 1.0038 0.9821 1.0310 1.0204 1.0596 1.0001 1.0058 1.0012 1.0212 0.9976 1.0085 0.9901 1.0107 1.0039 1.0067 1.0045 0.9941
dispcorr: -0.026954994 hartree
energy: -1400.186515774224
dipole: -46.87646 45.17412 -1.70234 -3.52401 3.48701 -0.03700 2.78037 -3.87016 -1.08979
magnitude: 2.02162 au
magnitude: 5.13856 debye
