program: Orca
programVersion: 4.2.1
elementType: Cl O N N N C C C C C C C C C C C C C C C C C C H H H H H H H H H H H H H H H H H H H H H H H H
charge: 0
multiplicity: 1
keywords: wb97x-d3
keywords: def2-TZVPP
keywords: def2/J RIJCOSX GRIDX6 NOFINALGRIDX
keywords: grid4 nofinalgrid
keywords: scfconv7
keywords: smallprint printgap noloewdin
keywords: NOSOSCF
formula: C18H24ClN3O
InChI: InChI=1/C18H24ClN3O/c1-13(2)17-8-5-15(9-14-3-6-16(19)7-4-14)18(17,23)10-22-12-20-11-21-22/h3-4,6-7,11-13,15,17,23H,5,8-10H2,1-2H3
47 atoms
Cl 5.213297 3.305926 -0.705981
O  -2.078761 -1.149002 1.503242
N  -0.708406 -2.706514 -0.518737
N  0.383477 -2.590433 -1.280084
N  0.735628 -4.069604 0.3688
C  -1.975212 -0.658097 0.182194
C  -3.213557 0.192122 -0.268753
C  -0.772299 0.309905 0.054093
C  -2.740691 1.666673 -0.233133
C  -1.369665 1.662212 0.427624
C  -4.520365 -0.049579 0.506382
C  -1.876069 -1.880302 -0.730493
C  0.462575 -0.034974 0.895312
C  -5.64129 0.816635 -0.06886
C  -4.987581 -1.503333 0.481298
C  1.648545 0.803784 0.507718
C  -0.481203 -3.583594 0.457368
C  2.013208 1.930777 1.237924
C  2.4084 0.473558 -0.613196
C  3.103952 2.707905 0.872369
C  3.50174 1.235156 -0.994921
C  1.217341 -3.421226 -0.707343
C  3.841178 2.349936 -0.243731
H  -3.424946 -0.071534 -1.311472
H  -0.485992 0.342337 -1.003974
H  -3.433821 2.315704 0.302078
H  -2.666615 2.060783 -1.247922
H  -0.745856 2.500763 0.116426
H  -1.467625 1.737287 1.517039
H  -4.371112 0.249027 1.551163
H  -1.849656 -1.558168 -1.768935
H  -2.755449 -2.512486 -0.611634
H  0.735749 -1.084951 0.797505
H  0.240717 0.125533 1.952568
H  -2.150887 -0.407689 2.114194
H  -6.568964 0.660206 0.484374
H  -5.422214 1.883341 -0.029813
H  -5.835827 0.558474 -1.112862
H  -5.954022 -1.597699 0.980427
H  -4.301777 -2.181406 0.984229
H  -5.122405 -1.853595 -0.545436
H  -1.222152 -3.853021 1.192173
H  1.443667 2.211517 2.115482
H  2.146932 -0.400151 -1.198753
H  3.373284 3.57714 1.456785
H  4.082563 0.957174 -1.863871
H  2.213881 -3.57329 -1.091349
elementType: Cl O N C H
totalener: -1400.15759091 hartree
nucrepener: 2120.22780621 hartree
electener: -3520.38539712 hartree
oneelecener: -6124.53355665 hartree
twoeener: 2604.14815953 hartree
cpcmener: -0.02949955 hartree
kineticenergy: 1395.26251756 hartree
xcener: -114.438171955892 hartree
chargesum: -0.0000000
charge: -0.108887 -0.434857 0.120924 -0.368743 -0.413335 0.481303 -0.169332 -0.019696 -0.147427 -0.237307 0.092946 -0.202846 -0.121781 -0.310656 -0.346905 0.074227 0.066909 -0.242214 -0.248903 -0.137922 -0.164622 0.066306 0.089190 0.080658 0.082660 0.081361 0.093243 0.082063 0.078639 0.036401 0.117562 0.166105 0.103262 0.097755 0.212969 0.091019 0.091942 0.086329 0.096789 0.090695 0.088412 0.166178 0.141414 0.148601 0.144956 0.142775 0.161839
qa: -0.1089 -0.4349 0.1209 -0.3687 -0.4133 0.4813 -0.1693 -0.0197 -0.1474 -0.2373 0.0929 -0.2028 -0.1218 -0.3107 -0.3469 0.0742 0.0669 -0.2422 -0.2489 -0.1379 -0.1646 0.0663 0.0892 0.0807 0.0827 0.0814 0.0932 0.0821 0.0786 0.0364 0.1176 0.1661 0.1033 0.0978 0.2130 0.0910 0.0919 0.0863 0.0968 0.0907 0.0884 0.1662 0.1414 0.1486 0.1450 0.1428 0.1618
va: 1.1957 1.9987 3.3413 2.8265 3.0326 3.6701 4.0028 3.8378 3.9267 4.0308 3.7883 3.8852 3.7870 3.9416 3.9324 3.4717 4.0628 3.9961 3.9902 3.9706 4.0377 4.0174 3.8065 1.0088 1.0225 1.0151 1.0032 1.0144 1.0096 1.0194 1.0182 0.9824 1.0164 1.0266 1.0252 1.0049 1.0092 1.0005 1.0082 1.0206 0.9980 1.0064 1.0059 1.0124 1.0041 1.0069 0.9973
dispcorr: -0.027419014 hartree
energy: -1400.185009923883
dipole: -47.92437 45.25997 -2.66440 -4.67697 5.63846 0.96150 4.25516 -3.95855 0.29661
magnitude: 2.84806 au
magnitude: 7.23920 debye
