program: Orca
programVersion: 4.2.1
elementType: Cl O N N N C C C C C C C C C C C C C C C C C C H H H H H H H H H H H H H H H H H H H H H H H H
charge: 0
multiplicity: 1
keywords: wb97x-d3
keywords: def2-TZVPP
keywords: def2/J RIJCOSX GRIDX6 NOFINALGRIDX
keywords: grid4 nofinalgrid
keywords: scfconv7
keywords: smallprint printgap noloewdin
keywords: NOSOSCF
formula: C18H24ClN3O
InChI: InChI=1/C18H24ClN3O/c1-13(2)17-8-5-15(9-14-3-6-16(19)7-4-14)18(17,23)10-22-12-20-11-21-22/h3-4,6-7,11-13,15,17,23H,5,8-10H2,1-2H3
47 atoms
Cl 5.13952 3.418836 -0.8226
O  -2.046757 -1.078934 1.559782
N  -0.757518 -2.769357 -0.547804
N  -0.532297 -3.413835 0.601874
N  1.184874 -3.710937 -0.806094
C  -1.939522 -0.699337 0.203868
C  -3.167767 0.182589 -0.186857
C  -0.712015 0.228436 -0.000668
C  -2.656227 1.643203 -0.174047
C  -1.244541 1.601033 0.392715
C  -4.448358 -0.019352 0.64084
C  -1.915649 -1.922575 -0.724916
C  0.555255 -0.143191 0.77943
C  -5.565416 0.873321 0.098657
C  -4.956347 -1.459353 0.64639
C  1.711842 0.738969 0.402018
C  0.275739 -2.946576 -1.36771
C  2.045799 1.861701 1.153666
C  2.465186 0.463011 -0.736752
C  3.095109 2.691616 0.785592
C  3.518278 1.278347 -1.122068
C  0.642861 -3.958973 0.397609
C  3.822993 2.39134 -0.354015
H  -3.431815 -0.074459 -1.219648
H  -0.475976 0.239603 -1.072932
H  -3.295373 2.302496 0.413147
H  -2.64484 2.045355 -1.188178
H  -0.620802 2.417487 0.028132
H  -1.269035 1.681831 1.483766
H  -4.24743 0.283006 1.674328
H  -1.906021 -1.593641 -1.762558
H  -2.80827 -2.532027 -0.58501
H  0.852026 -1.178577 0.610396
H  0.360882 -0.048681 1.84949
H  -1.434478 -1.808003 1.728553
H  -6.478679 0.742565 0.682265
H  -5.318203 1.934502 0.126371
H  -5.801416 0.617208 -0.937664
H  -5.15334 -1.810136 -0.369368
H  -5.897825 -1.526547 1.194804
H  -4.263515 -2.15297 1.11564
H  0.317443 -2.52002 -2.357088
H  1.482455 2.097892 2.048156
H  2.235356 -0.410212 -1.337106
H  3.339867 3.558085 1.38492
H  4.093888 1.044431 -2.007232
H  1.12208 -4.564838 1.149975
elementType: Cl O N C H
totalener: -1400.15978591 hartree
nucrepener: 2120.66848598 hartree
electener: -3520.82827189 hartree
oneelecener: -6125.34242151 hartree
twoeener: 2604.51414962 hartree
cpcmener: -0.02914550 hartree
kineticenergy: 1395.26579035 hartree
xcener: -114.441388857246 hartree
chargesum: 0.0000000
charge: -0.107788 -0.454928 0.134316 -0.392495 -0.406629 0.435354 -0.142133 0.017768 -0.161760 -0.238969 0.104088 -0.195183 -0.143816 -0.310714 -0.349385 0.057496 0.038055 -0.241578 -0.234520 -0.137912 -0.161116 0.084314 0.091801 0.080630 0.090072 0.078146 0.092015 0.082920 0.080500 0.034311 0.114278 0.166113 0.094544 0.106967 0.226699 0.090750 0.091790 0.085252 0.087699 0.096653 0.088010 0.184093 0.140773 0.153347 0.144930 0.142832 0.162413
qa: -0.1078 -0.4549 0.1343 -0.3925 -0.4066 0.4354 -0.1421 0.0178 -0.1618 -0.2390 0.1041 -0.1952 -0.1438 -0.3107 -0.3494 0.0575 0.0381 -0.2416 -0.2345 -0.1379 -0.1611 0.0843 0.0918 0.0806 0.0901 0.0781 0.0920 0.0829 0.0805 0.0343 0.1143 0.1661 0.0945 0.1070 0.2267 0.0908 0.0918 0.0853 0.0877 0.0967 0.0880 0.1841 0.1408 0.1533 0.1449 0.1428 0.1624
va: 1.1970 1.9881 3.3294 2.8351 2.9980 3.7472 3.8863 3.7600 3.9594 4.0329 3.7946 3.9132 3.7862 3.9390 3.9350 3.5082 4.0376 3.9920 3.9869 3.9737 4.0288 4.0138 3.8080 1.0113 1.0192 1.0143 1.0025 1.0126 1.0138 1.0246 1.0062 0.9814 1.0223 1.0297 1.0432 1.0049 1.0086 1.0010 0.9980 1.0083 1.0254 0.9905 1.0059 0.9976 1.0040 1.0075 0.9956
dispcorr: -0.027246872 hartree
energy: -1400.187032777015
dipole: -45.91810 44.39154 -1.52656 -5.69591 5.79695 0.10104 3.74260 -4.78828 -1.04567
magnitude: 1.85312 au
magnitude: 4.71025 debye
