program: Orca
programVersion: 4.2.1
elementType: Cl O N N N C C C C C C C C C C C C C C C C C C H H H H H H H H H H H H H H H H H H H H H H H H
charge: 0
multiplicity: 1
keywords: wb97x-d3
keywords: def2-TZVPP
keywords: def2/J RIJCOSX GRIDX6 NOFINALGRIDX
keywords: grid4 nofinalgrid
keywords: scfconv7
keywords: smallprint printgap noloewdin
keywords: NOSOSCF
formula: C18H24ClN3O
InChI: InChI=1/C18H24ClN3O/c1-13(2)17-8-5-15(9-14-3-6-16(19)7-4-14)18(17,23)10-22-12-20-11-21-22/h3-4,6-7,11-13,15,17,23H,5,8-10H2,1-2H3
47 atoms
Cl 5.313173 3.182933 -0.622447
O  -2.018357 -1.194697 1.446253
N  -0.73103 -2.756661 -0.563905
N  0.355398 -2.608786 -1.327888
N  0.760666 -4.063187 0.329849
C  -1.967287 -0.712056 0.118335
C  -3.192871 0.153586 -0.244469
C  -0.76076 0.251172 -0.121176
C  -2.810257 1.52132 0.314513
C  -1.360437 1.67789 -0.136501
C  -4.588696 -0.384143 0.11089
C  -1.918348 -1.956186 -0.763521
C  0.371623 0.090854 0.900693
C  -5.013003 -0.177173 1.562553
C  -5.627646 0.246361 -0.814557
C  1.597755 0.873866 0.521106
C  -0.470838 -3.616807 0.419958
C  1.941989 2.049094 1.1818
C  2.427866 0.433842 -0.509125
C  3.078023 2.768846 0.836137
C  3.567177 1.135765 -0.868783
C  1.218117 -3.407758 -0.752928
C  3.883582 2.302071 -0.188216
H  -3.160806 0.251178 -1.338477
H  -0.347631 0.032583 -1.108795
H  -2.875916 1.532316 1.407488
H  -3.455093 2.325243 -0.042739
H  -1.332516 2.085605 -1.148426
H  -0.803019 2.371761 0.494811
H  -4.598405 -1.462523 -0.084753
H  -1.94811 -1.673987 -1.813729
H  -2.783992 -2.591427 -0.570587
H  0.647836 -0.960815 1.003454
H  0.037046 0.420093 1.887702
H  -2.071509 -0.451506 2.056593
H  -4.346538 -0.660272 2.274703
H  -5.069507 0.882064 1.821239
H  -6.008069 -0.596737 1.722753
H  -5.66913 1.330557 -0.686537
H  -6.626346 -0.143521 -0.610078
H  -5.404702 0.046418 -1.864106
H  -1.200202 -3.905519 1.15898
H  1.321469 2.413382 1.991464
H  2.18624 -0.480109 -1.039255
H  3.329017 3.677586 1.366168
H  4.202282 0.772916 -1.665506
H  2.217267 -3.531735 -1.140313
elementType: Cl O N C H
totalener: -1400.15849267 hartree
nucrepener: 2117.50950558 hartree
electener: -3517.66799825 hartree
oneelecener: -6119.10591898 hartree
twoeener: 2601.43792073 hartree
cpcmener: -0.03046325 hartree
kineticenergy: 1395.26086352 hartree
xcener: -114.437943818765 hartree
chargesum: -0.0000000
charge: -0.108325 -0.432222 0.116939 -0.366820 -0.414621 0.494970 -0.095394 -0.114164 -0.225312 -0.150844 0.036571 -0.171838 -0.120826 -0.322747 -0.300164 0.064424 0.065192 -0.224576 -0.240676 -0.154313 -0.172143 0.061944 0.096898 0.083342 0.085137 0.079958 0.086118 0.093793 0.078127 0.037512 0.118492 0.135337 0.109834 0.102240 0.217152 0.091639 0.084940 0.097102 0.084043 0.091383 0.089942 0.168607 0.144214 0.147234 0.144877 0.142373 0.164652
qa: -0.1083 -0.4322 0.1169 -0.3668 -0.4146 0.4950 -0.0954 -0.1142 -0.2253 -0.1508 0.0366 -0.1718 -0.1208 -0.3227 -0.3002 0.0644 0.0652 -0.2246 -0.2407 -0.1543 -0.1721 0.0619 0.0969 0.0833 0.0851 0.0800 0.0861 0.0938 0.0781 0.0375 0.1185 0.1353 0.1098 0.1022 0.2172 0.0916 0.0849 0.0971 0.0840 0.0914 0.0899 0.1686 0.1442 0.1472 0.1449 0.1424 0.1647
va: 1.1962 2.0105 3.3528 2.8445 3.0280 3.7411 3.8719 3.9023 4.0290 3.9340 3.8296 3.8931 3.7736 3.9155 3.9222 3.4590 4.0584 3.9899 3.9851 3.9905 4.0501 4.0221 3.8028 1.0104 1.0272 1.0042 1.0141 1.0050 1.0191 1.0229 1.0145 1.0024 1.0121 1.0173 1.0201 1.0224 0.9952 1.0040 1.0015 1.0048 1.0042 1.0069 1.0041 1.0099 1.0051 1.0075 0.9957
dispcorr: -0.027292490 hartree
energy: -1400.185785163480
dipole: -48.32613 45.60187 -2.72425 -2.91491 3.81791 0.90300 4.53420 -4.30966 0.22454
magnitude: 2.87878 au
magnitude: 7.31729 debye
