program: Orca
programVersion: 4.2.1
elementType: Cl O N N N C C C C C C C C C C C C C C C C C C H H H H H H H H H H H H H H H H H H H H H H H H
charge: 0
multiplicity: 1
keywords: wb97x-d3
keywords: def2-TZVPP
keywords: def2/J RIJCOSX GRIDX6 NOFINALGRIDX
keywords: grid4 nofinalgrid
keywords: scfconv7
keywords: smallprint printgap noloewdin
keywords: NOSOSCF
formula: C18H24ClN3O
InChI: InChI=1/C18H24ClN3O/c1-13(2)17-8-5-15(9-14-3-6-16(19)7-4-14)18(17,23)10-22-12-20-11-21-22/h3-4,6-7,11-13,15,17,23H,5,8-10H2,1-2H3
47 atoms
Cl 5.536771 1.09805 -0.115722
O  -1.149858 0.274157 1.29084
N  -0.244624 -2.156408 -0.119579
N  -0.194016 -2.422383 1.190818
N  -0.653584 -4.287159 0.038166
C  -1.270392 0.098712 -0.103003
C  -2.663204 -0.477415 -0.549506
C  -1.1920 1.496703 -0.764239
C  -3.342533 0.657573 -1.341872
C  -2.648581 1.930341 -0.88675
C  -3.534089 -1.066726 0.576904
C  -0.134933 -0.799205 -0.617471
C  -0.312199 2.53733 -0.070087
C  -4.23417 -0.033257 1.455315
C  -4.567568 -2.016791 -0.022834
C  1.151737 2.200609 -0.058899
C  -0.531504 -3.27097 -0.786459
C  1.78592 1.72917 1.087423
C  1.908773 2.326316 -1.22205
C  3.131292 1.38894 1.080311
C  3.253626 1.990818 -1.251541
C  -0.44225 -3.708349 1.231381
C  3.853946 1.520202 -0.094174
H  -2.479834 -1.306214 -1.240799
H  -0.811238 1.357745 -1.784137
H  -4.425397 0.685399 -1.209448
H  -3.168527 0.517688 -2.411687
H  -2.772565 2.761153 -1.583651
H  -3.029343 2.261297 0.084199
H  -2.892739 -1.67487 1.224409
H  0.839517 -0.405601 -0.328178
H  -0.15825 -0.85786 -1.704906
H  -0.666708 2.708303 0.947006
H  -0.452156 3.481915 -0.604889
H  -0.978782 -0.585539 1.700027
H  -4.778663 -0.531935 2.260075
H  -3.537812 0.664351 1.915195
H  -4.968964 0.546641 0.892281
H  -5.237712 -1.500189 -0.71427
H  -5.188646 -2.465141 0.755138
H  -4.088288 -2.830771 -0.571496
H  -0.622944 -3.302749 -1.860607
H  1.223149 1.616169 2.004489
H  1.444429 2.695739 -2.128915
H  3.604801 1.024229 1.982038
H  3.823018 2.099253 -2.164603
H  -0.469827 -4.247805 2.165212
elementType: Cl O N C H
totalener: -1400.15740171 hartree
nucrepener: 2167.54341569 hartree
electener: -3567.70081740 hartree
oneelecener: -6219.29145044 hartree
twoeener: 2651.59063304 hartree
cpcmener: -0.02596662 hartree
kineticenergy: 1395.26768819 hartree
xcener: -114.442342730239 hartree
chargesum: -0.0000000
charge: -0.108886 -0.439390 0.139882 -0.397767 -0.410655 0.350711 -0.051424 0.019304 -0.181178 -0.230131 0.032740 -0.178832 -0.096282 -0.315674 -0.304470 0.040175 0.055689 -0.235788 -0.220796 -0.137516 -0.145293 0.082388 0.086851 0.075423 0.083021 0.083674 0.091510 0.089241 0.086011 0.024964 0.140627 0.120996 0.086024 0.104159 0.215566 0.099891 0.089348 0.084587 0.085465 0.093322 0.085846 0.182340 0.130196 0.140079 0.144590 0.145304 0.164158
qa: -0.1089 -0.4394 0.1399 -0.3978 -0.4107 0.3507 -0.0514 0.0193 -0.1812 -0.2301 0.0327 -0.1788 -0.0963 -0.3157 -0.3045 0.0402 0.0557 -0.2358 -0.2208 -0.1375 -0.1453 0.0824 0.0869 0.0754 0.0830 0.0837 0.0915 0.0892 0.0860 0.0250 0.1406 0.1210 0.0860 0.1042 0.2156 0.0999 0.0893 0.0846 0.0855 0.0933 0.0858 0.1823 0.1302 0.1401 0.1446 0.1453 0.1642
va: 1.1964 1.9851 3.3328 2.8470 3.0155 3.7851 3.8341 3.8058 3.9326 3.9951 3.8260 3.9386 3.7992 3.9061 3.9325 3.5209 4.0395 3.9660 3.9779 3.9688 3.9701 4.0146 3.8169 1.0081 1.0146 1.0119 1.0046 1.0194 1.0009 1.0367 1.0025 1.0055 1.0212 1.0056 1.0603 1.0048 1.0268 0.9992 1.0032 1.0041 1.0050 0.9905 1.0269 1.0050 1.0043 1.0040 0.9943
dispcorr: -0.028574659 hartree
energy: -1400.185976367460
dipole: -45.10049 44.05590 -1.04459 1.02613 -0.24943 0.77670 -2.15265 0.62252 -1.53013
magnitude: 2.00891 au
magnitude: 5.10625 debye
