program: Orca
programVersion: 4.2.1
elementType: Cl O N N N C C C C C C C C C C C C C C C C C C H H H H H H H H H H H H H H H H H H H H H H H H
charge: 0
multiplicity: 1
keywords: wb97x-d3
keywords: def2-TZVPP
keywords: def2/J RIJCOSX GRIDX6 NOFINALGRIDX
keywords: grid4 nofinalgrid
keywords: scfconv7
keywords: smallprint printgap noloewdin
keywords: NOSOSCF
formula: C18H24ClN3O
InChI: InChI=1/C18H24ClN3O/c1-13(2)17-8-5-15(9-14-3-6-16(19)7-4-14)18(17,23)10-22-12-20-11-21-22/h3-4,6-7,11-13,15,17,23H,5,8-10H2,1-2H3
47 atoms
Cl 5.283374 1.071403 1.231564
O  -1.554925 1.374608 1.000358
N  -0.224337 -1.942273 0.062766
N  -1.081155 -2.965706 0.089693
N  0.688385 -3.468565 -1.184367
C  -1.468253 0.261442 0.134432
C  -2.85409 -0.353136 -0.150644
C  -1.029868 0.784213 -1.253795
C  -3.486367 0.672164 -1.086121
C  -2.343982 1.04574 -2.031869
C  -3.695204 -0.799312 1.059618
C  -0.470027 -0.716895 0.786358
C  -0.12104 2.019351 -1.259167
C  -4.555204 0.299725 1.682882
C  -4.585688 -1.975439 0.666488
C  1.231213 1.814565 -0.636198
C  0.826974 -2.259227 -0.69707
C  2.211058 1.086732 -1.309563
C  1.543679 2.320781 0.622317
C  3.455945 0.850375 -0.746163
C  2.785565 2.101486 1.201332
C  -0.496512 -3.854058 -0.673077
C  3.731247 1.359295 0.513312
H  -2.664646 -1.249251 -0.751683
H  -0.49032 -0.02378 -1.757421
H  -3.818512 1.55034 -0.529529
H  -4.356679 0.279139 -1.614141
H  -2.372215 0.42939 -2.932103
H  -2.415779 2.083319 -2.36393
H  -3.015148 -1.171449 1.836076
H  -0.822154 -0.993357 1.782166
H  0.490627 -0.222005 0.920895
H  -0.631345 2.858757 -0.784559
H  0.019013 2.303945 -2.306042
H  -1.850077 1.078522 1.868412
H  -3.997372 1.197354 1.950018
H  -5.357778 0.609907 1.010325
H  -5.028296 -0.066514 2.596158
H  -5.265828 -1.704923 -0.145099
H  -5.198493 -2.308791 1.506816
H  -3.988038 -2.825403 0.334126
H  1.660358 -1.591485 -0.852551
H  2.005727 0.695818 -2.299783
H  0.807314 2.895272 1.168745
H  4.19975 0.280715 -1.287184
H  3.007665 2.505267 2.180161
H  -0.940279 -4.818784 -0.865136
elementType: Cl O N C H
totalener: -1400.16625075 hartree
nucrepener: 2174.58858059 hartree
electener: -3574.75483134 hartree
oneelecener: -6233.05624582 hartree
twoeener: 2658.30141448 hartree
cpcmener: -0.02270600 hartree
kineticenergy: 1395.24465022 hartree
xcener: -114.436500245604 hartree
chargesum: -0.0000000
charge: -0.103756 -0.407678 0.154334 -0.374708 -0.413604 0.408979 -0.052236 -0.051979 -0.190779 -0.164860 -0.008527 -0.278473 -0.118160 -0.297234 -0.313594 0.099037 0.038958 -0.332304 -0.224311 -0.121219 -0.131642 0.082220 0.085907 0.082824 0.101021 0.082177 0.083251 0.087248 0.073239 0.052198 0.141400 0.146163 0.093098 0.108362 0.207628 0.081923 0.083467 0.099346 0.086630 0.091339 0.090414 0.187889 0.154440 0.129653 0.148070 0.143556 0.160292
qa: -0.1038 -0.4077 0.1543 -0.3747 -0.4136 0.4090 -0.0522 -0.0520 -0.1908 -0.1649 -0.0085 -0.2785 -0.1182 -0.2972 -0.3136 0.0990 0.0390 -0.3323 -0.2243 -0.1212 -0.1316 0.0822 0.0859 0.0828 0.1010 0.0822 0.0833 0.0872 0.0732 0.0522 0.1414 0.1462 0.0931 0.1084 0.2076 0.0819 0.0835 0.0993 0.0866 0.0913 0.0904 0.1879 0.1544 0.1297 0.1481 0.1436 0.1603
va: 1.2022 2.0574 3.2801 2.8309 3.0419 3.8822 3.7764 3.7854 3.9886 3.9770 3.8066 3.9885 3.8181 3.9266 3.9276 3.4230 4.0556 3.9754 3.9919 3.9198 3.9712 4.0082 3.8341 1.0305 1.0145 1.0149 1.0138 1.0049 1.0118 1.0217 1.0025 0.9943 1.0152 1.0015 1.0260 1.0219 0.9945 1.0064 1.0006 1.0040 1.0136 0.9938 1.0003 1.0264 1.0024 1.0047 0.9943
dispcorr: -0.029030293 hartree
energy: -1400.195281044466
dipole: -44.76113 43.64935 -1.11178 0.19211 0.78170 0.97381 -3.25925 3.57119 0.31195
magnitude: 1.51052 au
magnitude: 3.83943 debye
