program: Orca
programVersion: 4.2.1
elementType: Cl O N N N C C C C C C C C C C C C C C C C C C H H H H H H H H H H H H H H H H H H H H H H H H
charge: 0
multiplicity: 1
keywords: wb97x-d3
keywords: def2-TZVPP
keywords: def2/J RIJCOSX GRIDX6 NOFINALGRIDX
keywords: grid4 nofinalgrid
keywords: scfconv7
keywords: smallprint printgap noloewdin
keywords: NOSOSCF
formula: C18H24ClN3O
InChI: InChI=1/C18H24ClN3O/c1-13(2)17-8-5-15(9-14-3-6-16(19)7-4-14)18(17,23)10-22-12-20-11-21-22/h3-4,6-7,11-13,15,17,23H,5,8-10H2,1-2H3
47 atoms
Cl 5.457437 0.656153 0.678684
O  -1.912474 1.37179 1.229357
N  -0.187797 -1.689588 0.282291
N  -0.926621 -2.77298 0.03032
N  1.126188 -3.017355 -0.826088
C  -1.665351 0.350567 0.281296
C  -2.952747 -0.35998 -0.187225
C  -1.141142 0.949033 -1.04747
C  -3.605779 0.673042 -1.109731
C  -2.425853 1.38692 -1.790091
C  -3.858034 -1.02616 0.858268
C  -0.698072 -0.570524 1.037966
C  -0.153559 2.11755 -0.957092
C  -4.568283 -0.081861 1.825468
C  -4.885089 -1.909202 0.151223
C  1.246341 1.76739 -0.539856
C  1.034426 -1.853865 -0.228747
C  2.144897 1.236569 -1.463298
C  1.688674 1.958654 0.766492
C  3.43876 0.893115 -1.100788
C  2.977541 1.617598 1.151854
C  -0.101947 -3.537448 -0.638961
C  3.843595 1.083126 0.211594
H  -2.607828 -1.171471 -0.836464
H  -0.673015 0.141806 -1.620702
H  -4.219103 1.385746 -0.550613
H  -4.275522 0.203844 -1.830173
H  -2.354166 1.13471 -2.84838
H  -2.546337 2.471839 -1.743384
H  -3.227164 -1.696664 1.451765
H  -1.193133 -0.965288 1.926085
H  0.163186 -0.003056 1.386115
H  -0.557545 2.885445 -0.29409
H  -0.108134 2.573266 -1.950323
H  -2.647099 1.92044 0.934526
H  -3.876908 0.464732 2.464182
H  -5.192849 0.647387 1.304489
H  -5.230793 -0.649214 2.482852
H  -5.467523 -2.486017 0.872416
H  -4.403727 -2.620492 -0.523285
H  -5.592986 -1.320652 -0.437165
H  1.814566 -1.114686 -0.133509
H  1.835343 1.085645 -2.490864
H  1.016362 2.379566 1.504657
H  4.118917 0.481965 -1.834668
H  3.298786 1.773033 2.173128
H  -0.396153 -4.510229 -1.001827
elementType: Cl O N C H
totalener: -1400.16549332 hartree
nucrepener: 2179.74856103 hartree
electener: -3579.91405435 hartree
oneelecener: -6243.48257068 hartree
twoeener: 2663.56851632 hartree
cpcmener: -0.02266832 hartree
kineticenergy: 1395.24024578 hartree
xcener: -114.438187615588 hartree
chargesum: -0.0000000
charge: -0.101130 -0.421284 0.149264 -0.375488 -0.411396 0.396099 -0.044569 -0.045407 -0.231041 -0.185066 0.057500 -0.256929 -0.123823 -0.328490 -0.315805 0.038665 0.077222 -0.240257 -0.232994 -0.146538 -0.138586 0.082422 0.103897 0.081720 0.097488 0.091527 0.085384 0.086159 0.087035 0.041100 0.142833 0.163150 0.088743 0.111399 0.216211 0.092972 0.085116 0.091115 0.094532 0.091673 0.084037 0.130671 0.137185 0.146809 0.141841 0.144809 0.160225
qa: -0.1011 -0.4213 0.1493 -0.3755 -0.4114 0.3961 -0.0446 -0.0454 -0.2310 -0.1851 0.0575 -0.2569 -0.1238 -0.3285 -0.3158 0.0387 0.0772 -0.2403 -0.2330 -0.1465 -0.1386 0.0824 0.1039 0.0817 0.0975 0.0915 0.0854 0.0862 0.0870 0.0411 0.1428 0.1631 0.0887 0.1114 0.2162 0.0930 0.0851 0.0911 0.0945 0.0917 0.0840 0.1307 0.1372 0.1468 0.1418 0.1448 0.1602
va: 1.2036 2.0236 3.2908 2.8411 3.0403 3.8698 3.7726 3.8402 3.9865 3.9444 3.7664 3.8647 3.8042 3.9209 3.9353 3.4669 4.0714 3.9594 3.9580 3.9408 3.9860 4.0143 3.8021 1.0391 1.0084 1.0033 1.0125 1.0091 1.0061 1.0309 1.0043 0.9929 1.0268 1.0023 1.0217 1.0244 0.9991 1.0057 1.0041 1.0044 0.9997 1.0276 1.0076 1.0180 1.0069 1.0054 0.9939
dispcorr: -0.029316923 hartree
energy: -1400.194810245321
dipole: -47.32007 45.73111 -1.58896 1.93275 -0.32446 1.60829 -2.49063 2.15829 -0.33234
magnitude: 2.28513 au
magnitude: 5.80835 debye
