program: Orca
programVersion: 4.2.1
elementType: Cl O N N N C C C C C C C C C C C C C C C C C C H H H H H H H H H H H H H H H H H H H H H H H H
charge: 0
multiplicity: 1
keywords: wb97x-d3
keywords: def2-TZVPP
keywords: def2/J RIJCOSX GRIDX6 NOFINALGRIDX
keywords: grid4 nofinalgrid
keywords: scfconv7
keywords: smallprint printgap noloewdin
keywords: NOSOSCF
formula: C18H24ClN3O
InChI: InChI=1/C18H24ClN3O/c1-13(2)17-8-5-15(9-14-3-6-16(19)7-4-14)18(17,23)10-22-12-20-11-21-22/h3-4,6-7,11-13,15,17,23H,5,8-10H2,1-2H3
47 atoms
Cl 5.325201 3.096937 -0.732849
O  -2.019791 -1.133528 1.482882
N  -0.721671 -2.790138 -0.596245
N  -0.376725 -3.284654 0.596777
N  1.212989 -3.723859 -0.908982
C  -1.952453 -0.763355 0.125846
C  -3.196538 0.092174 -0.204363
C  -0.734471 0.176063 -0.192953
C  -2.739286 1.516539 0.095267
C  -1.350782 1.549179 -0.525875
C  -4.536589 -0.355355 0.40529
C  -1.934408 -2.014723 -0.761517
C  0.28595 0.253868 0.951666
C  -4.797767 0.172719 1.813543
C  -5.686033 0.06082 -0.510926
C  1.543456 0.969067 0.544715
C  0.236522 -3.056329 -1.482709
C  1.799021 2.278033 0.94199
C  2.491235 0.333331 -0.256289
C  2.955141 2.941493 0.553951
C  3.652388 0.976065 -0.654127
C  0.790089 -3.835551 0.361933
C  3.873671 2.282379 -0.244731
H  -3.309108 0.036176 -1.29589
H  -0.206312 -0.201899 -1.073845
H  -2.6802 1.691488 1.173046
H  -3.406846 2.274513 -0.319084
H  -1.436882 1.670355 -1.6086
H  -0.74251 2.382272 -0.169242
H  -4.541968 -1.450353 0.454112
H  -1.989141 -1.734744 -1.812517
H  -2.79005 -2.656932 -0.542161
H  0.559047 -0.75052 1.285394
H  -0.157566 0.755565 1.814695
H  -1.398291 -1.858155 1.646427
H  -3.997582 -0.069627 2.510062
H  -4.926865 1.257702 1.816806
H  -5.719979 -0.256674 2.211573
H  -5.597984 -0.38924 -1.501997
H  -5.718556 1.145314 -0.643808
H  -6.650669 -0.243456 -0.099076
H  0.180131 -2.752891 -2.516523
H  1.089601 2.796191 1.576061
H  2.332328 -0.691686 -0.572468
H  3.133055 3.958192 0.877838
H  4.376297 0.460157 -1.270614
H  1.350578 -4.334463 1.137128
elementType: Cl O N C H
totalener: -1400.17027760 hartree
nucrepener: 2116.78080985 hartree
electener: -3516.95108745 hartree
oneelecener: -6117.68100610 hartree
twoeener: 2600.72991865 hartree
cpcmener: -0.02440585 hartree
kineticenergy: 1395.22973919 hartree
xcener: -114.433389831206 hartree
chargesum: -0.0000000
charge: -0.106117 -0.425760 0.143938 -0.394425 -0.408665 0.394616 -0.045013 -0.055839 -0.216529 -0.176779 0.025488 -0.159300 -0.127760 -0.322408 -0.298215 0.066952 0.051961 -0.231338 -0.234065 -0.150792 -0.164915 0.086575 0.094512 0.081620 0.079843 0.085625 0.083244 0.090261 0.086108 0.032677 0.110368 0.135482 0.105871 0.105445 0.211911 0.097377 0.080893 0.096976 0.086611 0.083595 0.090338 0.179894 0.143833 0.139047 0.142753 0.140924 0.163179
qa: -0.1061 -0.4258 0.1439 -0.3944 -0.4087 0.3946 -0.0450 -0.0558 -0.2165 -0.1768 0.0255 -0.1593 -0.1278 -0.3224 -0.2982 0.0670 0.0520 -0.2313 -0.2341 -0.1508 -0.1649 0.0866 0.0945 0.0816 0.0798 0.0856 0.0832 0.0903 0.0861 0.0327 0.1104 0.1355 0.1059 0.1054 0.2119 0.0974 0.0809 0.0970 0.0866 0.0836 0.0903 0.1799 0.1438 0.1390 0.1428 0.1409 0.1632
va: 1.1991 2.0089 3.2969 2.8382 2.9949 3.8188 3.7658 3.8818 4.0242 3.9433 3.8422 3.9404 3.7544 3.9235 3.9274 3.4599 4.0228 3.9860 3.9892 3.9898 4.0382 4.0058 3.8197 1.0085 1.0152 1.0010 1.0140 1.0058 1.0162 1.0311 1.0037 0.9962 1.0262 1.0241 1.0637 1.0224 0.9955 1.0045 1.0050 1.0018 1.0044 0.9900 1.0027 1.0122 1.0056 1.0075 0.9945
dispcorr: -0.027006981 hartree
energy: -1400.197284579220
dipole: -47.05462 45.41771 -1.63691 -3.15347 3.10739 -0.04608 3.90927 -4.91987 -1.01060
magnitude: 1.92429 au
magnitude: 4.89116 debye
