program: Orca
programVersion: 4.2.1
elementType: Cl O N N N C C C C C C C C C C C C C C C C C C H H H H H H H H H H H H H H H H H H H H H H H H
charge: 0
multiplicity: 1
keywords: wb97x-d3
keywords: def2-TZVPP
keywords: def2/J RIJCOSX GRIDX6 NOFINALGRIDX
keywords: grid4 nofinalgrid
keywords: scfconv7
keywords: smallprint printgap noloewdin
keywords: NOSOSCF
formula: C18H24ClN3O
InChI: InChI=1/C18H24ClN3O/c1-13(2)17-8-5-15(9-14-3-6-16(19)7-4-14)18(17,23)10-22-12-20-11-21-22/h3-4,6-7,11-13,15,17,23H,5,8-10H2,1-2H3
47 atoms
Cl 4.962834 4.654579 -0.618927
O  -1.224674 -1.215723 1.550999
N  -1.251454 -3.461748 -0.268157
N  -2.036692 -3.829509 -1.284005
N  -2.461135 -5.084524 0.518558
C  -0.944039 -1.037268 0.180658
C  -2.252053 -0.622837 -0.566192
C  0.039839 0.136866 -0.062225
C  -2.009314 0.821792 -1.051801
C  -0.870331 1.351316 -0.193697
C  -3.567076 -0.812411 0.216778
C  -0.35113 -2.335869 -0.381654
C  1.152372 0.272147 0.979125
C  -3.848155 0.252354 1.275025
C  -4.737301 -0.875986 -0.762291
C  2.126148 1.356371 0.611837
C  -1.517303 -4.216468 0.799502
C  3.152191 1.115961 -0.298868
C  2.002769 2.63979 1.136237
C  4.028513 2.119937 -0.681912
C  2.867367 3.659028 0.764852
C  -2.74271 -4.80322 -0.767752
C  3.875385 3.388894 -0.145914
H  -2.33962 -1.267787 -1.443869
H  0.511416 -0.029895 -1.039681
H  -2.903992 1.444313 -1.005454
H  -1.696632 0.814088 -2.098982
H  -0.366791 2.211715 -0.636922
H  -1.233656 1.658936 0.791872
H  -3.522668 -1.781479 0.722744
H  0.576559 -2.59169 0.137404
H  -0.106669 -2.223983 -1.436603
H  1.694437 -0.674153 1.078536
H  0.720653 0.497516 1.957556
H  -0.408867 -1.429472 2.017488
H  -4.046445 1.228832 0.8272
H  -4.739825 -0.014148 1.84708
H  -3.031498 0.369427 1.983773
H  -5.681597 -1.032525 -0.236489
H  -4.620403 -1.69493 -1.475062
H  -4.83743 0.049344 -1.335635
H  -1.001717 -4.112858 1.740393
H  3.278599 0.125255 -0.719697
H  1.217941 2.856272 1.851001
H  4.820455 1.910917 -1.388559
H  2.752477 4.649428 1.184364
H  -3.484168 -5.3347 -1.34404
elementType: Cl O N C H
totalener: -1400.16857724 hartree
nucrepener: 2088.26253255 hartree
electener: -3488.43110978 hartree
oneelecener: -6060.31603923 hartree
twoeener: 2571.88492945 hartree
cpcmener: -0.03002341 hartree
kineticenergy: 1395.24115824 hartree
xcener: -114.432448227076 hartree
chargesum: -0.0000000
charge: -0.104794 -0.391518 0.123972 -0.347483 -0.410724 0.354655 -0.049074 0.008220 -0.198979 -0.224980 0.051530 -0.173582 -0.119129 -0.321910 -0.302236 0.025423 0.059861 -0.228420 -0.223386 -0.152260 -0.146227 0.057291 0.091219 0.079051 0.087406 0.084765 0.091828 0.089187 0.084534 0.029914 0.132826 0.112651 0.109522 0.094113 0.204938 0.084069 0.100447 0.088962 0.091714 0.084707 0.083171 0.162519 0.140555 0.139579 0.142878 0.142896 0.160299
qa: -0.1048 -0.3915 0.1240 -0.3475 -0.4107 0.3547 -0.0491 0.0082 -0.1990 -0.2250 0.0515 -0.1736 -0.1191 -0.3219 -0.3022 0.0254 0.0599 -0.2284 -0.2234 -0.1523 -0.1462 0.0573 0.0912 0.0791 0.0874 0.0848 0.0918 0.0892 0.0845 0.0299 0.1328 0.1127 0.1095 0.0941 0.2049 0.0841 0.1004 0.0890 0.0917 0.0847 0.0832 0.1625 0.1406 0.1396 0.1429 0.1429 0.1603
va: 1.2007 2.0331 3.3497 2.8720 3.0280 3.8329 3.7947 3.7884 3.9832 3.9817 3.8349 3.9442 3.7816 3.9081 3.9285 3.5454 4.0710 3.9955 3.9674 3.9876 3.9867 4.0385 3.8299 1.0256 1.0216 1.0116 1.0050 1.0152 1.0068 1.0257 0.9944 1.0190 1.0119 1.0229 1.0246 0.9995 1.0039 1.0260 1.0041 1.0089 1.0035 1.0040 1.0051 1.0058 1.0054 1.0053 0.9962
dispcorr: -0.026921767 hartree
energy: -1400.195499004614
dipole: -33.65361 34.80855 1.15494 -10.22942 10.61156 0.38214 2.51225 -2.14655 0.36570
magnitude: 1.27030 au
magnitude: 3.22884 debye
