program: Orca
programVersion: 4.2.1
elementType: Cl O N N N C C C C C C C C C C C C C C C C C C H H H H H H H H H H H H H H H H H H H H H H H H
charge: 0
multiplicity: 1
keywords: wb97x-d3
keywords: def2-TZVPP
keywords: def2/J RIJCOSX GRIDX6 NOFINALGRIDX
keywords: grid4 nofinalgrid
keywords: scfconv7
keywords: smallprint printgap noloewdin
keywords: NOSOSCF
formula: C18H24ClN3O
InChI: InChI=1/C18H24ClN3O/c1-13(2)17-8-5-15(9-14-3-6-16(19)7-4-14)18(17,23)10-22-12-20-11-21-22/h3-4,6-7,11-13,15,17,23H,5,8-10H2,1-2H3
47 atoms
Cl 5.385826 3.148135 -0.527125
O  -1.864865 -1.303808 1.378534
N  -0.812272 -2.7911 -0.70802
N  0.310031 -2.66523 -1.422166
N  0.512473 -4.333614 0.054982
C  -1.912113 -0.715731 0.099148
C  -3.178492 0.176745 -0.118027
C  -0.682659 0.216761 -0.200335
C  -2.644984 1.607364 -0.035639
C  -1.295917 1.517612 -0.727056
C  -4.38626 -0.10445 0.786386
C  -1.93386 -1.89233 -0.878202
C  0.224091 0.450658 1.016895
C  -5.489536 0.920175 0.526708
C  -4.957049 -1.50922 0.614699
C  1.50471 1.140441 0.639497
C  -0.675696 -3.787247 0.168332
C  1.759156 2.462726 0.988158
C  2.479812 0.455531 -0.085162
C  2.9468 3.089862 0.633561
C  3.670897 1.061545 -0.44835
C  1.073729 -3.608557 -0.931061
C  3.894783 2.380758 -0.083077
H  -3.508826 0.021426 -1.155444
H  -0.061218 -0.241497 -0.97255
H  -2.527074 1.914541 1.010463
H  -3.307475 2.334238 -0.506303
H  -1.445127 1.454254 -1.808763
H  -0.65903 2.387163 -0.55208
H  -4.07851 0.011448 1.832209
H  -1.910428 -1.528997 -1.904494
H  -2.847018 -2.475165 -0.761681
H  0.472639 -0.50758 1.478869
H  -0.291843 1.042271 1.780428
H  -1.866824 -0.619898 2.055718
H  -5.179549 1.937461 0.76718
H  -5.80528 0.908989 -0.519937
H  -6.369501 0.702305 1.135336
H  -4.254819 -2.287929 0.909427
H  -5.253676 -1.694602 -0.421325
H  -5.848651 -1.637524 1.231995
H  -1.456154 -4.08309 0.85074
H  1.02419 3.020924 1.555592
H  2.31107 -0.575836 -0.373515
H  3.124713 4.117959 0.919252
H  4.41514 0.508159 -1.005111
H  2.071552 -3.782743 -1.303953
elementType: Cl O N C H
totalener: -1400.16899578 hartree
nucrepener: 2110.17090812 hartree
electener: -3510.33990390 hartree
oneelecener: -6104.41092616 hartree
twoeener: 2594.07102226 hartree
cpcmener: -0.02620196 hartree
kineticenergy: 1395.23363731 hartree
xcener: -114.431932083276 hartree
chargesum: -0.0000000
charge: -0.106272 -0.402125 0.130651 -0.369487 -0.414068 0.290930 -0.037124 0.021293 -0.208165 -0.202897 0.070368 -0.199704 -0.090473 -0.309270 -0.332994 0.025528 0.065250 -0.231875 -0.225229 -0.145651 -0.165806 0.065355 0.096672 0.079398 0.082064 0.080175 0.085033 0.089885 0.087563 0.024082 0.124446 0.160374 0.113495 0.094930 0.210350 0.093196 0.088368 0.090910 0.091012 0.089398 0.096242 0.166500 0.140058 0.141629 0.142521 0.140046 0.163419
qa: -0.1063 -0.4021 0.1307 -0.3695 -0.4141 0.2909 -0.0371 0.0213 -0.2082 -0.2029 0.0704 -0.1997 -0.0905 -0.3093 -0.3330 0.0255 0.0652 -0.2319 -0.2252 -0.1457 -0.1658 0.0654 0.0967 0.0794 0.0821 0.0802 0.0850 0.0899 0.0876 0.0241 0.1244 0.1604 0.1135 0.0949 0.2103 0.0932 0.0884 0.0909 0.0910 0.0894 0.0962 0.1665 0.1401 0.1416 0.1425 0.1400 0.1634
va: 1.1989 2.0078 3.3267 2.8585 3.0346 3.8763 3.8409 3.7520 3.9681 3.9929 3.8029 3.8796 3.7038 3.9436 3.9273 3.5365 4.0724 3.9682 3.9911 3.9822 4.0303 4.0245 3.8165 1.0121 1.0400 1.0048 1.0131 1.0058 1.0139 1.0253 1.0156 0.9843 1.0266 1.0132 1.0251 1.0015 0.9998 1.0063 1.0150 0.9985 1.0089 1.0026 1.0054 1.0092 1.0056 1.0080 0.9948
dispcorr: -0.026824249 hartree
energy: -1400.195820029874
dipole: -47.98129 45.39650 -2.58478 -3.49006 4.56938 1.07932 4.55686 -4.14908 0.40778
magnitude: 2.83061 au
magnitude: 7.19483 debye
