program: Orca
programVersion: 4.2.1
elementType: Cl O N N N C C C C C C C C C C C C C C C C C C H H H H H H H H H H H H H H H H H H H H H H H H
charge: 0
multiplicity: 1
keywords: wb97x-d3
keywords: def2-TZVPP
keywords: def2/J RIJCOSX GRIDX6 NOFINALGRIDX
keywords: grid4 nofinalgrid
keywords: scfconv7
keywords: smallprint printgap noloewdin
keywords: NOSOSCF
formula: C18H24ClN3O
InChI: InChI=1/C18H24ClN3O/c1-13(2)17-8-5-15(9-14-3-6-16(19)7-4-14)18(17,23)10-22-12-20-11-21-22/h3-4,6-7,11-13,15,17,23H,5,8-10H2,1-2H3
47 atoms
Cl 5.257655 3.305542 -0.698118
O  -1.890767 -1.15443 1.425741
N  -0.752372 -2.809708 -0.605095
N  0.417616 -2.63554 -1.225083
N  0.560545 -4.314726 0.246959
C  -1.91881 -0.722516 0.083126
C  -3.162997 0.140852 -0.228842
C  -0.715938 0.239099 -0.154185
C  -2.751669 1.526815 0.25458
C  -1.324643 1.655731 -0.261801
C  -4.522073 -0.388789 0.268255
C  -1.881983 -1.942268 -0.846644
C  0.384351 0.145675 0.911172
C  -4.875985 0.018258 1.698367
C  -5.635121 0.06459 -0.673534
C  1.603853 0.935176 0.52292
C  -0.650429 -3.809118 0.272036
C  1.923238 2.134589 1.15166
C  2.444803 0.48578 -0.494652
C  3.041048 2.871578 0.783866
C  3.567053 1.203938 -0.874866
C  1.172299 -3.560066 -0.685086
C  3.855427 2.397379 -0.229784
H  -3.219246 0.192952 -1.32496
H  -0.260685 -0.022692 -1.112042
H  -2.766325 1.574407 1.346268
H  -3.408032 2.3184 -0.111614
H  -1.336414 1.980374 -1.304561
H  -0.748054 2.401821 0.287503
H  -4.506589 -1.486287 0.228171
H  -1.844548 -1.630697 -1.889558
H  -2.786526 -2.54265 -0.723856
H  0.675526 -0.895633 1.063889
H  0.010109 0.508646 1.87047
H  -2.683504 -1.670368 1.609858
H  -5.789705 -0.486791 2.017374
H  -4.101697 -0.226408 2.425125
H  -5.06148 1.091737 1.772707
H  -5.690147 1.15475 -0.725195
H  -6.609633 -0.295171 -0.337575
H  -5.480621 -0.306711 -1.688281
H  -1.472652 -4.141316 0.885934
H  1.294454 2.507555 1.951262
H  2.221767 -0.44573 -1.002479
H  3.269439 3.801542 1.287172
H  4.208831 0.834375 -1.663463
H  2.20148 -3.696767 -0.979364
elementType: Cl O N C H
totalener: -1400.16929521 hartree
nucrepener: 2111.79039046 hartree
electener: -3511.95968567 hartree
oneelecener: -6107.91196660 hartree
twoeener: 2595.95228093 hartree
cpcmener: -0.02895222 hartree
kineticenergy: 1395.23862271 hartree
xcener: -114.432770819247 hartree
chargesum: -0.0000000
charge: -0.107710 -0.404937 0.136787 -0.372290 -0.410432 0.423586 -0.080208 -0.065004 -0.205191 -0.161540 -0.014596 -0.190304 -0.112540 -0.302952 -0.296043 0.066673 0.058684 -0.228018 -0.237136 -0.151751 -0.168809 0.070432 0.098109 0.082379 0.086295 0.084354 0.083850 0.090539 0.079665 0.047273 0.116190 0.132960 0.108317 0.097490 0.209461 0.101175 0.086710 0.084667 0.086792 0.091305 0.088671 0.169940 0.142087 0.142878 0.141993 0.139496 0.160705
qa: -0.1077 -0.4049 0.1368 -0.3723 -0.4104 0.4236 -0.0802 -0.0650 -0.2052 -0.1615 -0.0146 -0.1903 -0.1125 -0.3030 -0.2960 0.0667 0.0587 -0.2280 -0.2371 -0.1518 -0.1688 0.0704 0.0981 0.0824 0.0863 0.0844 0.0839 0.0905 0.0797 0.0473 0.1162 0.1330 0.1083 0.0975 0.2095 0.1012 0.0867 0.0847 0.0868 0.0913 0.0887 0.1699 0.1421 0.1429 0.1420 0.1395 0.1607
va: 1.1969 2.0361 3.3286 2.8382 3.0402 3.8185 3.8449 3.8047 4.0085 3.9476 3.8512 3.9205 3.7711 3.9218 3.9322 3.4483 4.0739 3.9856 3.9829 3.9900 4.0467 4.0207 3.8121 1.0128 1.0279 1.0072 1.0143 1.0057 1.0176 1.0177 1.0160 0.9983 1.0133 1.0261 1.0217 1.0060 1.0224 0.9951 1.0015 1.0042 1.0047 0.9975 1.0045 1.0128 1.0058 1.0084 0.9961
dispcorr: -0.026977307 hartree
energy: -1400.196272515144
dipole: -48.35649 45.12997 -3.22652 -4.23213 4.22314 -0.00899 4.73355 -4.86174 -0.12819
magnitude: 3.22908 au
magnitude: 8.20767 debye
