program: Orca
programVersion: 4.2.1
elementType: Cl O N N N C C C C C C C C C C C C C C C C C C H H H H H H H H H H H H H H H H H H H H H H H H
charge: 0
multiplicity: 1
keywords: wb97x-d3
keywords: def2-TZVPP
keywords: def2/J RIJCOSX GRIDX6 NOFINALGRIDX
keywords: grid4 nofinalgrid
keywords: scfconv7
keywords: smallprint printgap noloewdin
keywords: NOSOSCF
formula: C18H24ClN3O
InChI: InChI=1/C18H24ClN3O/c1-13(2)17-8-5-15(9-14-3-6-16(19)7-4-14)18(17,23)10-22-12-20-11-21-22/h3-4,6-7,11-13,15,17,23H,5,8-10H2,1-2H3
47 atoms
Cl 4.805785 4.771965 -0.212612
O  -0.776756 -1.713045 1.31718
N  -1.368913 -3.441014 -0.982253
N  -1.574215 -4.134432 0.141165
N  -2.805322 -4.976814 -1.518958
C  -0.892909 -1.206219 0.011729
C  -2.300097 -0.625591 -0.347239
C  0.106476 -0.010775 -0.169651
C  -1.935762 0.514128 -1.300913
C  -0.744447 1.175432 -0.628247
C  -3.116617 -0.194836 0.893466
C  -0.487462 -2.294232 -1.000193
C  0.982812 0.28823 1.049228
C  -4.116809 0.919781 0.596214
C  -3.883713 -1.384868 1.469818
C  1.947356 1.40493 0.761284
C  -2.11365 -3.951772 -1.962199
C  1.702221 2.702811 1.20001
C  3.101534 1.173758 0.015364
C  2.571638 3.743701 0.905924
C  3.983842 2.198737 -0.288997
C  -2.443467 -5.044046 -0.226586
C  3.708334 3.481194 0.159806
H  -2.905416 -1.369249 -0.879255
H  0.78454 -0.266665 -0.99308
H  -2.759529 1.196074 -1.507635
H  -1.633886 0.104491 -2.27039
H  -0.1991 1.853715 -1.285449
H  -1.078675 1.76538 0.231938
H  -2.435401 0.177063 1.665234
H  0.530105 -2.63188 -0.789698
H  -0.49737 -1.902503 -2.016071
H  1.540245 -0.60588 1.335766
H  0.359029 0.55992 1.903529
H  -1.12065 -2.618715 1.340362
H  -3.636611 1.864997 0.340578
H  -4.787891 0.652865 -0.224113
H  -4.738927 1.10995 1.473451
H  -4.654669 -1.719579 0.770154
H  -4.385629 -1.114622 2.401244
H  -3.250911 -2.244386 1.684214
H  -2.116672 -3.555333 -2.965477
H  0.817063 2.912843 1.788249
H  3.326036 0.172639 -0.334232
H  2.361443 4.74475 1.258161
H  4.876478 1.996704 -0.865868
H  -2.825466 -5.780015 0.463438
elementType: Cl O N C H
totalener: -1400.16837551 hartree
nucrepener: 2089.87429211 hartree
electener: -3490.04266762 hartree
oneelecener: -6063.78915809 hartree
twoeener: 2573.74649047 hartree
cpcmener: -0.02524932 hartree
kineticenergy: 1395.23235312 hartree
xcener: -114.435440816735 hartree
chargesum: 0.0000000
charge: -0.106507 -0.428049 0.124642 -0.387019 -0.406813 0.331227 0.000073 -0.043260 -0.192707 -0.205090 0.030608 -0.198287 -0.081984 -0.317241 -0.316143 0.038986 0.069565 -0.204111 -0.220604 -0.164261 -0.160912 0.087795 0.100364 0.082879 0.090853 0.087170 0.088245 0.088457 0.079058 0.045253 0.140039 0.120693 0.089313 0.089041 0.213244 0.085279 0.092110 0.092242 0.082368 0.096001 0.083419 0.176572 0.138104 0.141096 0.142515 0.141555 0.164218
qa: -0.1065 -0.4280 0.1246 -0.3870 -0.4068 0.3312 0.0001 -0.0433 -0.1927 -0.2051 0.0306 -0.1983 -0.0820 -0.3172 -0.3161 0.0390 0.0696 -0.2041 -0.2206 -0.1643 -0.1609 0.0878 0.1004 0.0829 0.0909 0.0872 0.0882 0.0885 0.0791 0.0453 0.1400 0.1207 0.0893 0.0890 0.2132 0.0853 0.0921 0.0922 0.0824 0.0960 0.0834 0.1766 0.1381 0.1411 0.1425 0.1416 0.1642
va: 1.1991 1.9790 3.3279 2.8596 3.0230 3.8788 3.7923 3.7587 3.9791 3.9658 3.7842 3.9801 3.8007 3.9447 3.9247 3.5200 4.0405 3.9627 3.9851 4.0049 3.9931 4.0081 3.8172 1.0005 1.0137 1.0069 1.0068 1.0159 1.0026 1.0232 0.9989 0.9969 1.0323 1.0148 1.0716 1.0007 0.9985 1.0067 1.0029 1.0056 1.0269 0.9912 1.0066 1.0043 1.0058 1.0062 0.9935
dispcorr: -0.026629123 hartree
energy: -1400.195004628607
dipole: -33.26684 32.99051 -0.27633 -10.64826 10.64237 -0.00590 2.87025 -3.88559 -1.01533
magnitude: 1.05228 au
magnitude: 2.67469 debye
