program: Orca
programVersion: 4.2.1
elementType: Cl O N N N C C C C C C C C C C C C C C C C C C H H H H H H H H H H H H H H H H H H H H H H H H
charge: 0
multiplicity: 1
keywords: wb97x-d3
keywords: def2-TZVPP
keywords: def2/J RIJCOSX GRIDX6 NOFINALGRIDX
keywords: grid4 nofinalgrid
keywords: scfconv7
keywords: smallprint printgap noloewdin
keywords: NOSOSCF
formula: C18H24ClN3O
InChI: InChI=1/C18H24ClN3O/c1-13(2)17-8-5-15(9-14-3-6-16(19)7-4-14)18(17,23)10-22-12-20-11-21-22/h3-4,6-7,11-13,15,17,23H,5,8-10H2,1-2H3
47 atoms
Cl 4.957163 0.620878 1.491851
O  -1.186523 -0.001195 1.014958
N  -0.215751 -2.046171 -0.788771
N  0.457924 -2.046534 -1.943415
N  1.768837 -2.781262 -0.28084
C  -1.783668 -0.172706 -0.242988
C  -3.320244 0.096233 -0.118621
C  -1.262654 0.82558 -1.330748
C  -3.55419 1.398438 -0.886338
C  -2.539642 1.322953 -2.014145
C  -3.912437 0.071186 1.296117
C  -1.595323 -1.625757 -0.715269
C  -0.453146 2.006087 -0.775886
C  -5.380395 0.495153 1.261069
C  -3.805652 -1.300897 1.95786
C  0.90048 1.658463 -0.209671
C  0.584622 -2.486754 0.19387
C  1.820149 0.913641 -0.945467
C  1.277154 2.082329 1.063225
C  3.063336 0.588398 -0.429067
C  2.521418 1.774557 1.591303
C  1.640298 -2.491968 -1.589832
C  3.409387 1.022998 0.840008
H  -3.831365 -0.694888 -0.688338
H  -0.635518 0.30023 -2.05547
H  -3.361192 2.264732 -0.245248
H  -4.578552 1.493096 -1.24734
H  -2.875772 0.59773 -2.761305
H  -2.393535 2.268309 -2.540075
H  -3.366912 0.792428 1.911394
H  -2.02236 -1.763778 -1.708423
H  -2.119009 -2.299479 -0.035032
H  -1.03016 2.548701 -0.023851
H  -0.302851 2.708384 -1.601791
H  -0.229822 0.055227 0.922019
H  -5.81938 0.442324 2.258398
H  -5.512375 1.516898 0.905607
H  -5.967395 -0.16034 0.612474
H  -2.773265 -1.61024 2.106917
H  -4.313266 -2.06429 1.361592
H  -4.283231 -1.292237 2.938894
H  0.259308 -2.592092 1.217468
H  1.566128 0.566378 -1.938599
H  0.581572 2.659227 1.660526
H  3.756994 -0.004497 -1.008315
H  2.794156 2.111051 2.581983
H  2.435304 -2.623684 -2.307236
totalener: -1400.14035755 hartree
nucrepener: 2202.06168002 hartree
electener: -3602.20203757 hartree
oneelecener: -6288.22171332 hartree
twoeener: 2686.01967575 hartree
kineticenergy: 1395.25218953 hartree
xcener: -114.436033762919 hartree
chargesum: 0.0000000
charge: -0.078413 -0.365509 0.137614 -0.326427 -0.315805 0.270578 -0.083606 0.093983 -0.200274 -0.193646 0.095880 -0.244521 -0.141500 -0.284260 -0.321833 0.021792 0.005411 -0.250156 -0.186847 -0.097255 -0.124712 0.036197 0.095483 0.074827 0.083260 0.080369 0.079701 0.087388 0.073809 0.035091 0.123250 0.147946 0.093609 0.095994 0.199929 0.084965 0.086550 0.080939 0.091250 0.077405 0.088814 0.158286 0.124349 0.117499 0.115652 0.120844 0.136100
qa: -0.0784 -0.3655 0.1376 -0.3264 -0.3158 0.2706 -0.0836 0.0940 -0.2003 -0.1936 0.0959 -0.2445 -0.1415 -0.2843 -0.3218 0.0218 0.0054 -0.2502 -0.1868 -0.0973 -0.1247 0.0362 0.0955 0.0748 0.0833 0.0804 0.0797 0.0874 0.0738 0.0351 0.1232 0.1479 0.0936 0.0960 0.1999 0.0850 0.0865 0.0809 0.0913 0.0774 0.0888 0.1583 0.1243 0.1175 0.1157 0.1208 0.1361
va: 1.2286 2.0538 3.2819 2.8103 3.0426 3.8429 3.8492 3.6904 3.9371 4.0095 3.7745 3.9532 3.8570 3.9384 3.9396 3.6726 4.0729 3.9745 3.9838 3.9673 4.0207 4.0372 3.9352 1.0134 1.0299 1.0044 1.0156 1.0077 1.0189 1.0329 1.0171 0.9858 1.0039 1.0014 1.0696 1.0100 1.0042 1.0012 1.0184 1.0011 1.0131 1.0033 1.0201 1.0129 1.0158 1.0139 1.0014
dispcorr: -0.029649020 hartree
energy: -1400.170006571299
dipole: -47.43589 45.98058 -1.45531 3.69672 -3.09075 0.60597 -2.63316 2.34385 -0.28931
magnitude: 1.60276 au
magnitude: 4.07388 debye
