program: Orca
programVersion: 4.2.1
elementType: Cl O N N N C C C C C C C C C C C C C C C C C C H H H H H H H H H H H H H H H H H H H H H H H H
charge: 0
multiplicity: 1
keywords: wb97x-d3
keywords: def2-TZVPP
keywords: def2/J RIJCOSX GRIDX6 NOFINALGRIDX
keywords: grid4 nofinalgrid
keywords: scfconv7
keywords: smallprint printgap noloewdin
keywords: NOSOSCF
formula: C18H24ClN3O
InChI: InChI=1/C18H24ClN3O/c1-13(2)17-8-5-15(9-14-3-6-16(19)7-4-14)18(17,23)10-22-12-20-11-21-22/h3-4,6-7,11-13,15,17,23H,5,8-10H2,1-2H3
47 atoms
Cl 5.462827 0.864488 -0.202545
O  -1.135954 0.257075 1.23038
N  -0.165566 -2.080261 -0.079128
N  -0.980304 -3.084621 -0.415178
N  0.294272 -3.668819 1.333838
C  -1.328155 0.110153 -0.156795
C  -2.749351 -0.428197 -0.555187
C  -1.247702 1.522867 -0.78111
C  -3.446644 0.743436 -1.275808
C  -2.698651 1.989378 -0.830573
C  -3.582854 -1.044432 0.585337
C  -0.218692 -0.792594 -0.727789
C  -0.322509 2.527442 -0.088544
C  -4.217061 -0.038217 1.544928
C  -4.659742 -1.952063 -0.004828
C  1.131473 2.147911 -0.096162
C  0.586058 -2.445155 0.969076
C  1.76472 1.670636 1.047218
C  1.877227 2.2321 -1.268855
C  3.094517 1.278277 1.023898
C  3.205378 1.839975 -1.313119
C  -0.668331 -4.014876 0.456215
C  3.807588 1.359184 -0.161338
H  -2.602518 -1.240541 -1.270088
H  -0.906015 1.401307 -1.818249
H  -4.517962 0.793001 -1.077006
H  -3.344863 0.6279 -2.357813
H  -2.839208 2.838735 -1.501589
H  -3.02326 2.306203 0.164708
H  -2.930461 -1.710496 1.165415
H  0.756523 -0.326078 -0.593424
H  -0.365268 -0.955394 -1.795424
H  -0.661416 2.689606 0.935087
H  -0.442188 3.485594 -0.603033
H  -1.408382 -0.548065 1.679237
H  -3.493469 0.64525 1.984818
H  -4.980069 0.562121 1.046447
H  -4.715743 -0.562262 2.361626
H  -5.347378 -1.394495 -0.64465
H  -5.254802 -2.4175 0.782211
H  -4.215524 -2.74838 -0.602738
H  1.329039 -1.798008 1.410274
H  1.206391 1.593481 1.970781
H  1.413743 2.611527 -2.172477
H  3.574196 0.9142 1.922298
H  3.769237 1.911558 -2.233056
H  -1.148927 -4.98079 0.452328
totalener: -1400.14096846 hartree
nucrepener: 2174.20873684 hartree
electener: -3574.34970530 hartree
oneelecener: -6232.36288402 hartree
twoeener: 2658.01317872 hartree
kineticenergy: 1395.26034958 hartree
xcener: -114.436274446624 hartree
chargesum: -0.0000000
charge: -0.079600 -0.366514 0.136634 -0.347716 -0.324656 0.314320 -0.013000 -0.005458 -0.176882 -0.214374 -0.015203 -0.199938 -0.128591 -0.278913 -0.281507 0.085289 0.016106 -0.217508 -0.229288 -0.128433 -0.107415 0.070180 0.077576 0.083566 0.072733 0.079543 0.086025 0.083351 0.087096 0.019237 0.125925 0.116783 0.091982 0.100141 0.187924 0.086597 0.080323 0.095146 0.079528 0.085757 0.094126 0.147221 0.116094 0.112756 0.128071 0.122511 0.132454
qa: -0.0796 -0.3665 0.1366 -0.3477 -0.3247 0.3143 -0.0130 -0.0055 -0.1769 -0.2144 -0.0152 -0.1999 -0.1286 -0.2789 -0.2815 0.0853 0.0161 -0.2175 -0.2293 -0.1284 -0.1074 0.0702 0.0776 0.0836 0.0727 0.0795 0.0860 0.0834 0.0871 0.0192 0.1259 0.1168 0.0920 0.1001 0.1879 0.0866 0.0803 0.0951 0.0795 0.0858 0.0941 0.1472 0.1161 0.1128 0.1281 0.1225 0.1325
va: 1.2276 2.0626 3.2842 2.8333 3.0637 3.8325 3.7341 3.8247 3.9326 3.9820 3.9222 3.9357 3.8379 3.9070 3.9365 3.5602 4.0914 3.9776 4.0101 3.9587 3.9875 4.0251 3.9294 1.0249 1.0142 1.0171 1.0084 1.0201 1.0051 1.0245 1.0068 1.0147 1.0204 1.0045 1.0571 1.0257 1.0018 1.0089 1.0057 1.0063 1.0117 1.0060 1.0310 1.0125 1.0097 1.0114 1.0020
dispcorr: -0.029005109 hartree
energy: -1400.169973570461
dipole: -45.45963 44.54303 -0.91660 2.56319 -1.57739 0.98580 -0.69465 0.17671 -0.51794
magnitude: 1.44230 au
magnitude: 3.66604 debye
