program: Orca
programVersion: 4.2.1
elementType: Cl O N N N C C C C C C C C C C C C C C C C C C H H H H H H H H H H H H H H H H H H H H H H H H
charge: 0
multiplicity: 1
keywords: wb97x-d3
keywords: def2-TZVPP
keywords: def2/J RIJCOSX GRIDX6 NOFINALGRIDX
keywords: grid4 nofinalgrid
keywords: scfconv7
keywords: smallprint printgap noloewdin
keywords: NOSOSCF
formula: C18H24ClN3O
InChI: InChI=1/C18H24ClN3O/c1-13(2)17-8-5-15(9-14-3-6-16(19)7-4-14)18(17,23)10-22-12-20-11-21-22/h3-4,6-7,11-13,15,17,23H,5,8-10H2,1-2H3
47 atoms
Cl 5.314298 3.171738 -0.677762
O  -1.936712 -1.176504 1.506068
N  -0.814466 -2.81861 -0.686901
N  -0.362559 -3.253241 0.49326
N  0.987955 -3.947334 -1.145901
C  -1.914061 -0.761391 0.169156
C  -3.143794 0.170459 -0.07717
C  -0.651141 0.102285 -0.193474
C  -2.547458 1.578275 -0.101492
C  -1.219677 1.382943 -0.810995
C  -4.334974 -0.000148 0.873617
C  -1.989334 -1.97525 -0.774402
C  0.248992 0.389667 1.0167
C  -5.401782 1.054071 0.578659
C  -4.963914 -1.388372 0.794106
C  1.515719 1.09096 0.615222
C  0.006566 -3.241465 -1.653612
C  1.711956 2.444693 0.863422
C  2.529834 0.394954 -0.039282
C  2.873394 3.093397 0.470166
C  3.696508 1.023568 -0.439532
C  0.718993 -3.924863 0.170706
C  3.860448 2.376276 -0.18291
H  -3.514246 -0.031395 -1.094098
H  -0.031075 -0.417552 -0.931109
H  -2.393902 1.940566 0.920745
H  -3.189238 2.301437 -0.60511
H  -1.396799 1.242487 -1.881692
H  -0.54081 2.232227 -0.721965
H  -3.981651 0.155381 1.896517
H  -2.057307 -1.638081 -1.809538
H  -2.875217 -2.575269 -0.559808
H  0.5128 -0.547104 1.511455
H  -0.290398 0.982638 1.758519
H  -1.324609 -1.919497 1.612671
H  -5.041691 2.069369 0.743017
H  -5.751573 0.988612 -0.454973
H  -6.269383 0.91294 1.224842
H  -5.282503 -1.620833 -0.226121
H  -5.851464 -1.445246 1.426125
H  -4.282769 -2.167129 1.130785
H  -0.147432 -3.016416 -2.697742
H  0.945349 3.009084 1.380967
H  2.411791 -0.664874 -0.236941
H  3.008958 4.146747 0.673218
H  4.474984 0.466817 -0.942725
H  1.330169 -4.412727 0.913397
totalener: -1400.14409262 hartree
nucrepener: 2115.08766644 hartree
electener: -3515.23175906 hartree
oneelecener: -6114.19159152 hartree
twoeener: 2598.95983246 hartree
kineticenergy: 1395.25066206 hartree
xcener: -114.435921744981 hartree
chargesum: 0.0000000
charge: -0.087212 -0.378695 0.131870 -0.350043 -0.329185 0.319025 -0.048690 0.006074 -0.197010 -0.209992 0.091583 -0.221297 -0.111769 -0.283499 -0.329068 0.090693 0.043943 -0.234381 -0.204697 -0.120047 -0.143977 0.070882 0.087152 0.067368 0.064398 0.081269 0.079157 0.077373 0.093590 0.039532 0.096392 0.149580 0.092395 0.099219 0.196648 0.086966 0.079067 0.084564 0.076304 0.087811 0.095331 0.142298 0.118429 0.121540 0.120030 0.120661 0.138415
qa: -0.0872 -0.3787 0.1319 -0.3500 -0.3292 0.3190 -0.0487 0.0061 -0.1970 -0.2100 0.0916 -0.2213 -0.1118 -0.2835 -0.3291 0.0907 0.0439 -0.2344 -0.2047 -0.1200 -0.1440 0.0709 0.0872 0.0674 0.0644 0.0813 0.0792 0.0774 0.0936 0.0395 0.0964 0.1496 0.0924 0.0992 0.1966 0.0870 0.0791 0.0846 0.0763 0.0878 0.0953 0.1423 0.1184 0.1215 0.1200 0.1207 0.1384
va: 1.2195 2.0471 3.3011 2.8524 3.0382 3.7950 3.8272 3.8382 3.9562 3.9954 3.7878 3.9817 3.7799 3.9392 3.9406 3.4968 4.0603 4.0113 4.0237 4.0108 4.0464 4.0217 3.9176 1.0140 1.0198 1.0061 1.0150 1.0089 1.0195 1.0338 1.0035 0.9862 1.0371 1.0214 1.0868 1.0043 1.0013 1.0099 0.9996 1.0133 1.0204 1.0008 1.0099 1.0110 1.0122 1.0135 1.0002
dispcorr: -0.026745858 hartree
energy: -1400.170838477500
dipole: -46.43489 45.20172 -1.23317 -4.27611 4.25731 -0.01880 3.78551 -4.28989 -0.50438
magnitude: 1.33247 au
magnitude: 3.38687 debye
