program: Orca
programVersion: 4.2.1
elementType: Cl O N N N C C C C C C C C C C C C C C C C C C H H H H H H H H H H H H H H H H H H H H H H H H
charge: 0
multiplicity: 1
keywords: wb97x-d3
keywords: def2-TZVPP
keywords: def2/J RIJCOSX GRIDX6 NOFINALGRIDX
keywords: grid4 nofinalgrid
keywords: scfconv7
keywords: smallprint printgap noloewdin
keywords: NOSOSCF
formula: C18H24ClN3O
InChI: InChI=1/C18H24ClN3O/c1-13(2)17-8-5-15(9-14-3-6-16(19)7-4-14)18(17,23)10-22-12-20-11-21-22/h3-4,6-7,11-13,15,17,23H,5,8-10H2,1-2H3
47 atoms
Cl 5.268699 3.314328 -0.688902
O  -2.012216 -1.188929 1.394133
N  -0.756716 -2.810444 -0.623766
N  0.468107 -2.61777 -1.122491
N  0.45119 -4.410044 0.223022
C  -1.902017 -0.713033 0.073866
C  -3.144013 0.147435 -0.224842
C  -0.708093 0.273992 -0.128052
C  -2.765753 1.507103 0.3536
C  -1.325678 1.691486 -0.111843
C  -4.517989 -0.418843 0.178024
C  -1.846159 -1.903212 -0.894971
C  0.421672 0.116227 0.896575
C  -4.915606 -0.147049 1.626727
C  -5.594534 0.12482 -0.760515
C  1.637836 0.915953 0.519622
C  -0.747185 -3.883249 0.180051
C  2.007022 2.055691 1.222681
C  2.420332 0.530938 -0.567014
C  3.120063 2.800352 0.859598
C  3.534671 1.260744 -0.94292
C  1.157173 -3.600169 -0.589481
C  3.878085 2.396876 -0.225159
H  -3.154632 0.266284 -1.318483
H  -0.274189 0.082867 -1.112318
H  -2.816446 1.482427 1.444053
H  -3.4248 2.309368 0.017612
H  -1.308401 2.119188 -1.116001
H  -0.765102 2.381011 0.520871
H  -4.494749 -1.506922 0.04511
H  -1.745771 -1.561859 -1.924813
H  -2.771215 -2.478162 -0.823151
H  0.727006 -0.932657 0.976522
H  0.07357 0.428357 1.885105
H  -1.160422 -1.52062 1.692784
H  -5.077289 0.918624 1.800825
H  -5.855341 -0.652071 1.856694
H  -4.167445 -0.495738 2.333845
H  -5.652972 1.214057 -0.705162
H  -6.579271 -0.265911 -0.500446
H  -5.398256 -0.142405 -1.800381
H  -1.626755 -4.242237 0.692114
H  1.421792 2.373017 2.077561
H  2.153104 -0.358808 -1.12611
H  3.394419 3.684508 1.418253
H  4.135407 0.948602 -1.786053
H  2.205788 -3.738834 -0.800881
totalener: -1400.14141119 hartree
nucrepener: 2110.84547984 hartree
electener: -3510.98689103 hartree
oneelecener: -6105.57862639 hartree
twoeener: 2594.59173536 hartree
kineticenergy: 1395.25238111 hartree
xcener: -114.432657740431 hartree
chargesum: -0.0000000
charge: -0.086847 -0.360993 0.133716 -0.353657 -0.322187 0.436980 -0.086081 -0.056263 -0.211946 -0.152300 0.007794 -0.218382 -0.191368 -0.295588 -0.266732 0.070945 0.008722 -0.203644 -0.213779 -0.125405 -0.145167 0.081376 0.089171 0.076713 0.091407 0.088887 0.080585 0.088018 0.075498 0.033699 0.113077 0.122406 0.102209 0.115178 0.186841 0.075700 0.088444 0.103541 0.081079 0.086604 0.077716 0.157031 0.114028 0.132264 0.119548 0.119126 0.132034
qa: -0.0868 -0.3610 0.1337 -0.3537 -0.3222 0.4370 -0.0861 -0.0563 -0.2119 -0.1523 0.0078 -0.2184 -0.1914 -0.2956 -0.2667 0.0709 0.0087 -0.2036 -0.2138 -0.1254 -0.1452 0.0814 0.0892 0.0767 0.0914 0.0889 0.0806 0.0880 0.0755 0.0337 0.1131 0.1224 0.1022 0.1152 0.1868 0.0757 0.0884 0.1035 0.0811 0.0866 0.0777 0.1570 0.1140 0.1323 0.1195 0.1191 0.1320
va: 1.2188 2.0892 3.2818 2.7934 3.0632 3.7421 3.8371 3.7912 4.0292 3.9457 3.8722 3.9428 3.8071 3.9332 3.9195 3.5616 4.0836 4.0267 4.0041 4.0232 4.0633 4.0086 3.9141 1.0106 1.0214 1.0075 1.0140 1.0094 1.0235 1.0243 1.0157 1.0019 1.0124 1.0172 1.0581 0.9982 1.0070 1.0218 1.0045 1.0075 1.0071 1.0025 1.0116 1.0251 1.0127 1.0147 1.0024
dispcorr: -0.026931929 hartree
energy: -1400.168343116965
dipole: -46.83322 45.48749 -1.34572 -4.15754 4.31778 0.16024 4.58421 -4.68882 -0.10461
magnitude: 1.35926 au
magnitude: 3.45497 debye
