program: Orca
programVersion: 4.2.1
elementType: Cl O N N N C C C C C C C C C C C C C C C C C C H H H H H H H H H H H H H H H H H H H H H H H H
charge: 0
multiplicity: 1
keywords: wb97x-d3
keywords: def2-TZVPP
keywords: def2/J RIJCOSX GRIDX6 NOFINALGRIDX
keywords: grid4 nofinalgrid
keywords: scfconv7
keywords: smallprint printgap noloewdin
keywords: NOSOSCF
formula: C18H24ClN3O
InChI: InChI=1/C18H24ClN3O/c1-13(2)17-8-5-15(9-14-3-6-16(19)7-4-14)18(17,23)10-22-12-20-11-21-22/h3-4,6-7,11-13,15,17,23H,5,8-10H2,1-2H3
47 atoms
Cl 5.297876 3.217174 -0.998944
O  -2.01614 -1.013555 1.484219
N  -0.764301 -2.887399 -0.286753
N  0.482782 -2.755303 -0.749135
N  0.387229 -4.40269 0.767636
C  -1.890748 -0.704557 0.116998
C  -3.128888 0.112117 -0.298794
C  -0.69041 0.247695 -0.195466
C  -2.747338 1.536051 0.091262
C  -1.310422 1.648411 -0.403226
C  -4.505364 -0.391872 0.17276
C  -1.83051 -2.005914 -0.696877
C  0.408497 0.247955 0.874171
C  -4.906841 0.07529 1.569707
C  -5.577827 0.021779 -0.834468
C  1.632787 0.995164 0.423853
C  -0.801693 -3.873627 0.620347
C  2.454326 0.460218 -0.566229
C  1.973192 2.229609 0.962456
C  3.579044 1.135367 -1.007499
C  3.096148 2.921352 0.531685
C  1.136693 -3.68438 -0.091063
C  3.893558 2.367678 -0.454135
H  -3.135901 0.082688 -1.398607
H  -0.227113 -0.084698 -1.127249
H  -2.791598 1.657161 1.175779
H  -3.405619 2.288207 -0.346513
H  -1.301326 1.908289 -1.463661
H  -0.748086 2.432194 0.106072
H  -4.484051 -1.488023 0.189404
H  -1.700905 -1.794262 -1.757939
H  -2.766414 -2.555305 -0.578917
H  0.716929 -0.776392 1.109571
H  0.02946 0.692015 1.798813
H  -1.172352 -1.32088 1.827235
H  -5.854927 -0.382289 1.857327
H  -4.168276 -0.187196 2.322704
H  -5.053542 1.156782 1.599948
H  -5.634409 1.108675 -0.926758
H  -6.564144 -0.328863 -0.527305
H  -5.378897 -0.383634 -1.828146
H  -1.706193 -4.171164 1.128531
H  2.209033 -0.504846 -0.995273
H  1.356281 2.664171 1.739997
H  4.210093 0.706869 -1.773922
H  3.348243 3.880575 0.962287
H  2.191617 -3.852185 -0.241786
totalener: -1400.14110930 hartree
nucrepener: 2109.27890038 hartree
electener: -3509.42000968 hartree
oneelecener: -6102.45305194 hartree
twoeener: 2593.03304226 hartree
kineticenergy: 1395.25187915 hartree
xcener: -114.432171694432 hartree
chargesum: 0.0000000
charge: -0.086814 -0.357231 0.135124 -0.355074 -0.323004 0.432148 -0.087825 -0.050788 -0.210548 -0.155448 0.008360 -0.220160 -0.188819 -0.296560 -0.267174 0.072745 0.012580 -0.212699 -0.207795 -0.145067 -0.126688 0.081850 0.089456 0.076572 0.089776 0.088158 0.080660 0.087955 0.077884 0.034008 0.113497 0.121348 0.099878 0.117162 0.184920 0.088624 0.104086 0.075579 0.080925 0.086080 0.078128 0.155040 0.132881 0.115459 0.119237 0.119985 0.131590
qa: -0.0868 -0.3572 0.1351 -0.3551 -0.3230 0.4321 -0.0878 -0.0508 -0.2105 -0.1554 0.0084 -0.2202 -0.1888 -0.2966 -0.2672 0.0727 0.0126 -0.2127 -0.2078 -0.1451 -0.1267 0.0818 0.0895 0.0766 0.0898 0.0882 0.0807 0.0880 0.0779 0.0340 0.1135 0.1213 0.0999 0.1172 0.1849 0.0886 0.1041 0.0756 0.0809 0.0861 0.0781 0.1550 0.1329 0.1155 0.1192 0.1200 0.1316
va: 1.2194 2.0912 3.2783 2.7942 3.0623 3.7449 3.8383 3.7985 4.0240 3.9458 3.8716 3.9455 3.8061 3.9340 3.9199 3.5590 4.0848 4.0030 4.0277 4.0626 4.0247 4.0082 3.9153 1.0109 1.0216 1.0071 1.0142 1.0096 1.0231 1.0245 1.0150 1.0020 1.0147 1.0169 1.0589 1.0069 1.0214 0.9983 1.0044 1.0078 1.0070 1.0023 1.0243 1.0111 1.0149 1.0128 1.0022
dispcorr: -0.026864730 hartree
energy: -1400.167974026170
dipole: -46.82708 45.48642 -1.34066 -3.55894 3.70177 0.14283 4.21172 -4.37572 -0.16400
magnitude: 1.35818 au
magnitude: 3.45223 debye
