program: Orca
programVersion: 4.2.1
elementType: Cl O N N N C C C C C C C C C C C C C C C C C C H H H H H H H H H H H H H H H H H H H H H H H H
charge: 0
multiplicity: 1
keywords: wb97x-d3
keywords: def2-TZVPP
keywords: def2/J RIJCOSX GRIDX6 NOFINALGRIDX
keywords: grid4 nofinalgrid
keywords: scfconv7
keywords: smallprint printgap noloewdin
keywords: NOSOSCF
formula: C18H24ClN3O
InChI: InChI=1/C18H24ClN3O/c1-13(2)17-8-5-15(9-14-3-6-16(19)7-4-14)18(17,23)10-22-12-20-11-21-22/h3-4,6-7,11-13,15,17,23H,5,8-10H2,1-2H3
47 atoms
Cl 5.12293 0.398627 0.903245
O  -1.389107 -0.335997 1.285797
N  0.042819 -1.891595 -0.777259
N  0.820682 -1.856582 0.309825
N  2.061756 -2.223632 -1.513325
C  -1.853705 -0.432146 -0.028551
C  -3.413642 -0.489112 -0.045924
C  -1.445554 0.772767 -0.948489
C  -3.798063 0.253199 -1.32987
C  -2.759856 1.356748 -1.485437
C  -4.120958 -0.005567 1.232894
C  -1.388953 -1.762363 -0.655219
C  -0.594927 1.861042 -0.28819
C  -4.022424 1.487905 1.521283
C  -5.588512 -0.430493 1.204098
C  0.829615 1.492216 0.01848
C  0.80326 -2.110706 -1.856526
C  1.730688 1.230859 -1.009464
C  1.298587 1.433448 1.326619
C  3.050867 0.90467 -0.75008
C  2.617778 1.114699 1.607623
C  2.02275 -2.054378 -0.178322
C  3.485978 0.846292 0.563632
H  -3.712499 -1.540565 -0.139941
H  -0.87309 0.38457 -1.799195
H  -4.819743 0.636674 -1.310697
H  -3.750017 -0.428367 -2.184347
H  -2.66307 1.700974 -2.5167
H  -3.045967 2.229419 -0.894596
H  -3.648279 -0.531039 2.065912
H  -1.810748 -1.87647 -1.655085
H  -1.753317 -2.592488 -0.045739
H  -1.08734 2.211041 0.620024
H  -0.586319 2.717057 -0.970943
H  -0.483737 -0.679104 1.333407
H  -4.493796 1.714523 2.478973
H  -2.990592 1.828546 1.584657
H  -4.537261 2.086477 0.766688
H  -6.142161 0.060318 0.400839
H  -6.085079 -0.170921 2.140128
H  -5.694665 -1.508035 1.066154
H  0.400154 -2.189541 -2.854784
H  1.401521 1.280228 -2.040946
H  0.620861 1.639318 2.145872
H  3.730744 0.684158 -1.560937
H  2.964681 1.070049 2.63086
H  2.897379 -2.076443 0.451972
totalener: -1400.13933853 hartree
nucrepener: 2226.08204458 hartree
electener: -3626.22138311 hartree
oneelecener: -6336.58417628 hartree
twoeener: 2710.36279316 hartree
kineticenergy: 1395.26204725 hartree
xcener: -114.443638292978 hartree
chargesum: 0.0000000
charge: -0.087925 -0.372378 0.131437 -0.331259 -0.326063 0.367500 -0.024418 -0.019011 -0.231832 -0.182780 0.080170 -0.244032 -0.137950 -0.325636 -0.281455 0.067879 0.020063 -0.231529 -0.216290 -0.092644 -0.085805 0.083029 0.033129 0.060586 0.062862 0.083077 0.078610 0.083064 0.092798 0.039535 0.109527 0.125048 0.094065 0.109114 0.202607 0.092581 0.105211 0.072578 0.072953 0.086757 0.080422 0.138871 0.111283 0.128081 0.121907 0.118705 0.137556
qa: -0.0879 -0.3724 0.1314 -0.3313 -0.3261 0.3675 -0.0244 -0.0190 -0.2318 -0.1828 0.0802 -0.2440 -0.1380 -0.3256 -0.2815 0.0679 0.0201 -0.2315 -0.2163 -0.0926 -0.0858 0.0830 0.0331 0.0606 0.0629 0.0831 0.0786 0.0831 0.0928 0.0395 0.1095 0.1250 0.0941 0.1091 0.2026 0.0926 0.1052 0.0726 0.0730 0.0868 0.0804 0.1389 0.1113 0.1281 0.1219 0.1187 0.1376
va: 1.2177 2.0590 3.2947 2.8336 3.0367 3.7691 3.8687 3.7700 3.9996 3.8981 3.8325 3.9990 3.8617 3.9542 3.9211 3.5501 4.0926 3.9599 3.9951 3.9286 3.9832 4.0149 3.8990 1.0096 1.0071 1.0178 1.0083 1.0177 1.0021 1.0412 0.9951 1.0021 1.0117 1.0018 1.0893 1.0113 1.0135 0.9975 1.0074 1.0068 1.0063 1.0030 1.0102 1.0123 1.0169 1.0127 1.0007
dispcorr: -0.031233316 hartree
energy: -1400.170571846692
dipole: -49.93050 48.39061 -1.53989 5.82497 -5.77961 0.04536 -2.19442 1.43813 -0.75629
magnitude: 1.71619 au
magnitude: 4.36220 debye
