program: Orca
programVersion: 4.2.1
elementType: Cl O N N N C C C C C C C C C C C C C C C C C C H H H H H H H H H H H H H H H H H H H H H H H H
charge: 0
multiplicity: 1
keywords: wb97x-d3
keywords: def2-TZVPP
keywords: def2/J RIJCOSX GRIDX6 NOFINALGRIDX
keywords: grid4 nofinalgrid
keywords: scfconv7
keywords: smallprint printgap noloewdin
keywords: NOSOSCF
formula: C18H24ClN3O
InChI: InChI=1/C18H24ClN3O/c1-13(2)17-8-5-15(9-14-3-6-16(19)7-4-14)18(17,23)10-22-12-20-11-21-22/h3-4,6-7,11-13,15,17,23H,5,8-10H2,1-2H3
47 atoms
Cl 5.270502 3.085362 -0.49972
O  -2.22841 -1.190374 1.264711
N  -0.769052 -2.663985 -0.872068
N  -0.549967 -3.339585 0.260372
N  1.206683 -3.541227 -1.110721
C  -2.05343 -0.697809 -0.035528
C  -3.278806 0.178976 -0.463838
C  -0.809443 0.240247 -0.139913
C  -2.682722 1.551601 -0.825009
C  -1.387659 1.647033 -0.036315
C  -4.483107 0.284231 0.493572
C  -1.958734 -1.861244 -1.03713
C  0.307561 -0.037823 0.871665
C  -5.193608 -1.049428 0.714558
C  -4.225892 1.006114 1.813564
C  1.555492 0.73899 0.55686
C  0.291337 -2.791651 -1.676402
C  1.762936 2.018926 1.061372
C  2.532579 0.198607 -0.274545
C  2.898031 2.747174 0.741636
C  3.6747 0.910577 -0.604864
C  0.646548 -3.849988 0.072879
C  3.848651 2.187126 -0.095695
H  -3.703333 -0.260798 -1.374408
H  -0.384723 0.134744 -1.148105
H  -3.37519 2.369875 -0.618958
H  -2.45955 1.598345 -1.894531
H  -0.709018 2.411092 -0.416948
H  -1.59408 1.885564 1.011471
H  -5.188618 0.913388 -0.064554
H  -1.940948 -1.473942 -2.05629
H  -2.83337 -2.508368 -0.940191
H  0.562237 -1.098915 0.895859
H  -0.047119 0.213784 1.873499
H  -1.648664 -1.953215 1.397483
H  -4.622028 -1.719162 1.352597
H  -6.163442 -0.887221 1.188036
H  -5.382761 -1.561762 -0.232075
H  -3.542145 0.458013 2.457161
H  -5.165102 1.131179 2.355384
H  -3.819649 2.0069 1.658108
H  0.3499 -2.33418 -2.652224
H  1.027278 2.459131 1.723696
H  2.410874 -0.807563 -0.660365
H  3.044696 3.739647 1.145022
H  4.4273 0.472499 -1.245876
H  1.125485 -4.466809 0.816732
totalener: -1400.14076236 hartree
nucrepener: 2137.52210693 hartree
electener: -3537.66286929 hartree
oneelecener: -6159.03960162 hartree
twoeener: 2621.37673233 hartree
kineticenergy: 1395.25002360 hartree
xcener: -114.434637565029 hartree
chargesum: 0.0000000
charge: -0.087287 -0.367907 0.135618 -0.359993 -0.334699 0.330754 -0.042684 0.034672 -0.188084 -0.248894 0.058188 -0.206406 -0.191542 -0.307409 -0.294951 0.105714 0.027901 -0.234141 -0.214743 -0.120096 -0.141832 0.086770 0.085329 0.069279 0.075036 0.079874 0.081476 0.093591 0.087959 0.037736 0.100235 0.138593 0.096325 0.115468 0.194795 0.096721 0.089268 0.072935 0.100705 0.088789 0.072898 0.145534 0.120241 0.140111 0.120242 0.120895 0.137016
qa: -0.0873 -0.3679 0.1356 -0.3600 -0.3347 0.3308 -0.0427 0.0347 -0.1881 -0.2489 0.0582 -0.2064 -0.1915 -0.3074 -0.2950 0.1057 0.0279 -0.2341 -0.2147 -0.1201 -0.1418 0.0868 0.0853 0.0693 0.0750 0.0799 0.0815 0.0936 0.0880 0.0377 0.1002 0.1386 0.0963 0.1155 0.1948 0.0967 0.0893 0.0729 0.1007 0.0888 0.0729 0.1455 0.1202 0.1401 0.1202 0.1209 0.1370
va: 1.2188 2.0393 3.2923 2.8242 3.0196 3.7398 3.8445 3.7036 3.9951 3.9917 3.8331 3.9739 3.8139 3.9323 3.9136 3.5220 4.0431 4.0253 4.0030 4.0078 4.0597 4.0049 3.9132 1.0058 1.0200 1.0153 1.0079 1.0177 1.0035 1.0106 0.9990 0.9959 1.0329 1.0206 1.0777 1.0217 1.0073 1.0044 1.0186 1.0085 1.0040 1.0014 1.0073 1.0154 1.0119 1.0142 1.0014
dispcorr: -0.028082428 hartree
energy: -1400.168844791923
dipole: -44.72894 43.56344 -1.16550 -3.43674 3.43056 -0.00618 5.18045 -5.80239 -0.62194
magnitude: 1.32108 au
magnitude: 3.35791 debye
