program: Orca
programVersion: 4.2.1
elementType: Cl O N N N C C C C C C C C C C C C C C C C C C H H H H H H H H H H H H H H H H H H H H H H H H
charge: 0
multiplicity: 1
keywords: wb97x-d3
keywords: def2-TZVPP
keywords: def2/J RIJCOSX GRIDX6 NOFINALGRIDX
keywords: grid4 nofinalgrid
keywords: scfconv7
keywords: smallprint printgap noloewdin
keywords: NOSOSCF
formula: C18H24ClN3O
InChI: InChI=1/C18H24ClN3O/c1-13(2)17-8-5-15(9-14-3-6-16(19)7-4-14)18(17,23)10-22-12-20-11-21-22/h3-4,6-7,11-13,15,17,23H,5,8-10H2,1-2H3
47 atoms
Cl 5.198605 3.280474 -0.785582
O  -2.055135 -1.193685 1.475291
N  -0.718334 -2.762519 -0.479335
N  0.387321 -2.628964 -1.22003
N  0.71276 -4.1414 0.401805
C  -1.963961 -0.706841 0.154136
C  -3.176699 0.163015 -0.246903
C  -0.754953 0.252593 -0.061389
C  -2.816861 1.527828 0.334239
C  -1.340437 1.686194 -0.026499
C  -4.586655 -0.372879 0.051583
C  -1.888127 -1.955451 -0.720957
C  0.405826 0.05949 0.921559
C  -5.049742 -0.20385 1.496481
C  -5.595987 0.283022 -0.890197
C  1.610581 0.86315 0.515197
C  -0.504118 -3.664954 0.486725
C  2.011104 1.987899 1.225603
C  2.35045 0.499152 -0.608174
C  3.110802 2.738295 0.83495
C  3.451088 1.234572 -1.012408
C  1.216869 -3.474972 -0.6554
C  3.825088 2.355543 -0.286222
H  -3.10553 0.269685 -1.339437
H  -0.361182 0.060066 -1.062499
H  -2.953579 1.536537 1.4206
H  -3.436805 2.335855 -0.056159
H  -1.242191 2.15842 -1.004773
H  -0.809581 2.332467 0.674078
H  -4.594904 -1.446721 -0.168846
H  -1.875432 -1.677383 -1.773642
H  -2.768771 -2.578894 -0.553308
H  0.682798 -0.993714 0.990055
H  0.105992 0.362221 1.929839
H  -1.945638 -0.46983 2.09702
H  -4.397523 -0.709373 2.204576
H  -5.114931 0.848708 1.778796
H  -6.048686 -0.625429 1.6190
H  -5.639992 1.363235 -0.736693
H  -6.600695 -0.108319 -0.724538
H  -5.343493 0.108727 -1.937485
H  -1.25156 -3.935727 1.215159
H  1.460922 2.288919 2.109344
H  2.060114 -0.378448 -1.174872
H  3.409215 3.610301 1.400403
H  4.017794 0.937716 -1.884107
H  2.219597 -3.621229 -1.025451
totalener: -1400.14028763 hartree
nucrepener: 2116.63107227 hartree
electener: -3516.77135990 hartree
oneelecener: -6117.25276453 hartree
twoeener: 2600.48140463 hartree
kineticenergy: 1395.25191690 hartree
xcener: -114.433126962225 hartree
chargesum: -0.0000000
charge: -0.087690 -0.366131 0.117143 -0.342936 -0.327735 0.484710 -0.097338 -0.132823 -0.229831 -0.147709 0.035453 -0.212894 -0.147326 -0.311003 -0.270584 0.095897 0.053400 -0.198155 -0.213441 -0.125880 -0.143752 0.068774 0.087087 0.077940 0.090455 0.071693 0.086721 0.095025 0.074084 0.033298 0.114318 0.122961 0.124955 0.071592 0.178957 0.097059 0.079019 0.090933 0.079805 0.087330 0.081949 0.142658 0.110226 0.131618 0.119102 0.119348 0.131718
qa: -0.0877 -0.3661 0.1171 -0.3429 -0.3277 0.4847 -0.0973 -0.1328 -0.2298 -0.1477 0.0355 -0.2129 -0.1473 -0.3110 -0.2706 0.0959 0.0534 -0.1982 -0.2134 -0.1259 -0.1438 0.0688 0.0871 0.0779 0.0905 0.0717 0.0867 0.0950 0.0741 0.0333 0.1143 0.1230 0.1250 0.0716 0.1790 0.0971 0.0790 0.0909 0.0798 0.0873 0.0819 0.1427 0.1102 0.1316 0.1191 0.1193 0.1317
va: 1.2181 2.0735 3.3109 2.8022 3.0650 3.7056 3.8675 3.8581 4.0098 3.9336 3.8354 3.9269 3.8476 3.9214 3.9254 3.5457 4.0732 4.0183 4.0132 4.0296 4.0609 4.0217 3.9140 1.0127 1.0213 1.0083 1.0178 1.0097 1.0255 1.0212 1.0154 1.0039 1.0124 1.0203 1.0567 1.0242 0.9966 1.0089 1.0043 1.0076 1.0066 1.0121 1.0117 1.0218 1.0128 1.0142 1.0026
dispcorr: -0.027242224 hartree
energy: -1400.167529852694
dipole: -47.62212 45.77519 -1.84693 -3.20431 3.83008 0.62577 4.83361 -4.68308 0.15053
magnitude: 1.95586 au
magnitude: 4.97141 debye
