program: Orca
programVersion: 4.2.1
elementType: Cl O N N N C C C C C C C C C C C C C C C C C C H H H H H H H H H H H H H H H H H H H H H H H H
charge: 0
multiplicity: 1
keywords: wb97x-d3
keywords: def2-TZVPP
keywords: def2/J RIJCOSX GRIDX6 NOFINALGRIDX
keywords: grid4 nofinalgrid
keywords: scfconv7
keywords: smallprint printgap noloewdin
keywords: NOSOSCF
formula: C18H24ClN3O
InChI: InChI=1/C18H24ClN3O/c1-13(2)17-8-5-15(9-14-3-6-16(19)7-4-14)18(17,23)10-22-12-20-11-21-22/h3-4,6-7,11-13,15,17,23H,5,8-10H2,1-2H3
47 atoms
Cl 5.268121 1.280631 1.287176
O  -0.434229 0.197278 0.938225
N  -0.851701 -2.163841 -0.588289
N  -1.764867 -3.128285 -0.729059
N  -0.041267 -3.864819 0.501723
C  -1.285322 0.294478 -0.183069
C  -2.756125 0.382739 0.28516
C  -1.142702 1.650823 -0.918545
C  -3.483203 0.962336 -0.940226
C  -2.436739 1.773546 -1.724345
C  -3.4597 -0.843693 0.875813
C  -1.002073 -0.85092 -1.177536
C  0.108849 1.906647 -1.763758
C  -2.782104 -1.40136 2.123716
C  -4.90699 -0.490263 1.219602
C  1.40888 1.758405 -1.019238
C  0.164617 -2.619521 0.143411
C  2.30053 0.729618 -1.316126
C  1.747867 2.64271 0.006425
C  3.487814 0.572855 -0.613546
C  2.929386 2.504545 0.716676
C  -1.239101 -4.118539 -0.055597
C  3.790614 1.463991 0.401041
H  -2.750889 1.154394 1.067461
H  -1.162998 2.406922 -0.124855
H  -4.330688 1.577443 -0.640605
H  -3.891285 0.155962 -1.555507
H  -2.301362 1.369421 -2.730734
H  -2.723389 2.817911 -1.848257
H  -3.487802 -1.630358 0.117219
H  -0.077092 -0.650434 -1.7176
H  -1.78209 -0.926412 -1.933422
H  0.032709 2.92871 -2.145069
H  0.115494 1.264145 -2.647555
H  0.457832 0.458345 0.68322
H  -1.761488 -1.733936 1.950836
H  -2.751334 -0.65309 2.919344
H  -3.342277 -2.257343 2.50444
H  -5.490827 -0.215001 0.341058
H  -4.952768 0.344166 1.924652
H  -5.409792 -1.339836 1.685783
H  1.043414 -2.037628 0.367734
H  2.077483 0.036043 -2.117902
H  1.080739 3.458038 0.258104
H  4.163294 -0.23389 -0.862868
H  3.173412 3.201959 1.506196
H  -1.739662 -5.070112 0.029574
elementType: Cl O N C H
totalener: -1400.15404559 hartree
nucrepener: 2174.28883243 hartree
electener: -3574.44287802 hartree
oneelecener: -6232.30006020 hartree
twoeener: 2657.85718219 hartree
cpcmener: -0.03105827 hartree
kineticenergy: 1395.26387675 hartree
xcener: -114.444530371610 hartree
chargesum: 0.0000000
charge: -0.100728 -0.433584 0.169247 -0.352495 -0.414048 0.488436 -0.008616 -0.053913 -0.210170 -0.217256 0.000072 -0.374478 -0.118281 -0.316253 -0.311286 0.035055 0.063494 -0.252283 -0.248182 -0.133703 -0.128999 0.063314 0.093814 0.074206 0.094324 0.083875 0.085849 0.085009 0.092017 0.037542 0.177680 0.140618 0.112489 0.095941 0.235976 0.083853 0.092769 0.094862 0.092638 0.090304 0.090752 0.149847 0.152482 0.141364 0.147368 0.147122 0.161957
qa: -0.1007 -0.4336 0.1692 -0.3525 -0.4140 0.4884 -0.0086 -0.0539 -0.2102 -0.2173 0.0001 -0.3745 -0.1183 -0.3163 -0.3113 0.0351 0.0635 -0.2523 -0.2482 -0.1337 -0.1290 0.0633 0.0938 0.0742 0.0943 0.0839 0.0858 0.0850 0.0920 0.0375 0.1777 0.1406 0.1125 0.0959 0.2360 0.0839 0.0928 0.0949 0.0926 0.0903 0.0908 0.1498 0.1525 0.1414 0.1474 0.1471 0.1620
va: 1.2054 2.0124 3.2802 2.8573 3.0354 3.7137 3.7958 3.9373 3.9443 3.9840 3.8340 3.8990 3.7770 3.9210 3.9340 3.5032 4.0920 3.9676 4.0141 3.9638 3.9657 4.0228 3.8330 1.0294 1.0186 1.0073 1.0031 1.0059 1.0115 1.0400 0.9826 1.0097 1.0042 1.0050 1.0263 1.0127 1.0073 1.0052 1.0017 1.0003 1.0055 1.0127 1.0028 1.0063 1.0046 1.0041 0.9957
dispcorr: -0.029060609 hartree
energy: -1400.183106201398
dipole: -40.92671 40.52527 -0.40144 2.34427 -0.03053 2.31374 -4.43380 2.60417 -1.82963
magnitude: 2.97693 au
magnitude: 7.56676 debye
