program: Orca
programVersion: 4.2.1
elementType: Cl O N N N C C C C C C C C C C C C C C C C C C H H H H H H H H H H H H H H H H H H H H H H H H
charge: 0
multiplicity: 1
keywords: wb97x-d3
keywords: def2-TZVPP
keywords: def2/J RIJCOSX GRIDX6 NOFINALGRIDX
keywords: grid4 nofinalgrid
keywords: scfconv7
keywords: smallprint printgap noloewdin
keywords: NOSOSCF
formula: C18H24ClN3O
InChI: InChI=1/C18H24ClN3O/c1-13(2)17-8-5-15(9-14-3-6-16(19)7-4-14)18(17,23)10-22-12-20-11-21-22/h3-4,6-7,11-13,15,17,23H,5,8-10H2,1-2H3
47 atoms
Cl 5.0106 1.269233 1.717766
O  -0.842626 0.079463 1.144639
N  -0.564996 -2.052505 -0.766083
N  -0.081597 -2.387433 -1.966756
N  1.143086 -3.336001 -0.345599
C  -1.656019 0.113128 -0.008298
C  -3.071066 0.635168 0.348674
C  -1.214724 1.199775 -1.012431
C  -3.642371 1.079852 -1.011956
C  -2.431427 1.36633 -1.918559
C  -4.031071 -0.257986 1.14342
C  -1.794647 -1.30004 -0.609113
C  0.099556 1.041854 -1.774901
C  -3.452215 -0.756142 2.464467
C  -5.327683 0.502789 1.415507
C  1.331249 1.093955 -0.907478
C  0.173115 -2.628359 0.184883
C  2.241004 0.041476 -0.874727
C  1.598008 2.211521 -0.113561
C  3.372678 0.08255 -0.070964
C  2.723735 2.274741 0.690608
C  0.940175 -3.147292 -1.661832
C  3.602864 1.201746 0.708737
H  -2.893709 1.531785 0.956774
H  -1.134171 2.113531 -0.410719
H  -4.278913 1.956776 -0.901065
H  -4.271113 0.293448 -1.437306
H  -2.388036 0.664607 -2.755691
H  -2.459869 2.364601 -2.355675
H  -4.294036 -1.129662 0.532286
H  -2.2683 -1.271823 -1.588474
H  -2.440697 -1.900687 0.029284
H  0.14938 1.865492 -2.494033
H  0.097709 0.126652 -2.368886
H  0.083413 0.10882 0.879327
H  -2.586682 -1.404326 2.334381
H  -3.145953 0.0773 3.100564
H  -4.202903 -1.328112 3.013151
H  -5.840581 0.793845 0.498424
H  -5.135045 1.411665 1.991222
H  -6.022158 -0.110029 1.992691
H  -0.040187 -2.53537 1.237427
H  2.080384 -0.826532 -1.500204
H  0.920767 3.056741 -0.122261
H  4.062357 -0.750292 -0.061564
H  2.912215 3.152187 1.293912
H  1.561707 -3.588607 -2.425044
elementType: Cl O N C H
totalener: -1400.15470303 hartree
nucrepener: 2183.15612095 hartree
electener: -3583.31082398 hartree
oneelecener: -6250.20797927 hartree
twoeener: 2666.89715529 hartree
cpcmener: -0.02631841 hartree
kineticenergy: 1395.25322600 hartree
xcener: -114.442502074738 hartree
chargesum: -0.0000000
charge: -0.103786 -0.435812 0.153369 -0.359398 -0.399778 0.468561 -0.074465 0.004409 -0.209279 -0.212402 0.020422 -0.328639 -0.160158 -0.296629 -0.308580 0.006636 0.043999 -0.247588 -0.227284 -0.141112 -0.136713 0.044780 0.093647 0.071952 0.099790 0.086533 0.088118 0.083880 0.086955 0.036376 0.141493 0.167207 0.112591 0.103172 0.240976 0.083305 0.083200 0.092942 0.094230 0.088082 0.092251 0.170967 0.191989 0.139804 0.139026 0.145880 0.165082
qa: -0.1038 -0.4358 0.1534 -0.3594 -0.3998 0.4686 -0.0745 0.0044 -0.2093 -0.2124 0.0204 -0.3286 -0.1602 -0.2966 -0.3086 0.0066 0.0440 -0.2476 -0.2273 -0.1411 -0.1367 0.0448 0.0936 0.0720 0.0998 0.0865 0.0881 0.0839 0.0870 0.0364 0.1415 0.1672 0.1126 0.1032 0.2410 0.0833 0.0832 0.0929 0.0942 0.0881 0.0923 0.1710 0.1920 0.1398 0.1390 0.1459 0.1651
va: 1.2016 2.0085 3.3080 2.8423 3.0228 3.7226 3.8555 3.8260 3.9477 3.9787 3.8557 3.9061 3.7942 3.9403 3.9295 3.5526 4.0687 3.9321 4.0137 4.0186 3.9658 4.0464 3.8295 1.0332 1.0160 1.0057 1.0039 1.0054 1.0135 1.0143 1.0034 0.9848 1.0042 1.0217 1.0209 1.0118 1.0059 1.0066 1.0020 1.0005 1.0057 1.0085 0.9835 1.0056 1.0120 1.0045 0.9964
dispcorr: -0.029206014 hartree
energy: -1400.183909041130
dipole: -45.87089 43.81997 -2.05093 2.69039 -1.60864 1.08176 -2.79453 2.06090 -0.73363
magnitude: 2.43202 au
magnitude: 6.18169 debye
