program: Orca
programVersion: 4.2.1
elementType: Cl O N N N C C C C C C C C C C C C C C C C C C H H H H H H H H H H H H H H H H H H H H H H H H
charge: 0
multiplicity: 1
keywords: wb97x-d3
keywords: def2-TZVPP
keywords: def2/J RIJCOSX GRIDX6 NOFINALGRIDX
keywords: grid4 nofinalgrid
keywords: scfconv7
keywords: smallprint printgap noloewdin
keywords: NOSOSCF
formula: C18H24ClN3O
InChI: InChI=1/C18H24ClN3O/c1-13(2)17-8-5-15(9-14-3-6-16(19)7-4-14)18(17,23)10-22-12-20-11-21-22/h3-4,6-7,11-13,15,17,23H,5,8-10H2,1-2H3
47 atoms
Cl 5.2803 3.832687 -0.202096
O  -1.384088 -1.18089 1.627879
N  -1.251782 -2.850489 -0.53851
N  -1.722808 -3.696974 0.381489
N  0.034762 -4.593598 -0.666109
C  -1.661454 -0.550474 0.404527
C  -2.842838 0.451223 0.471634
C  -0.491668 0.40578 0.108693
C  -2.56418 1.419614 -0.690578
C  -1.045638 1.355151 -0.952756
C  -4.28068 -0.080541 0.497325
C  -1.893989 -1.572636 -0.742502
C  0.844743 -0.244397 -0.242538
C  -4.519473 -1.155003 1.555809
C  -5.254076 1.07609 0.716763
C  1.967375 0.755696 -0.245665
C  -0.2063 -3.400108 -1.156496
C  2.395533 1.363331 -1.422419
C  2.587987 1.124864 0.945854
C  3.409429 2.310833 -1.420016
C  3.604125 2.067478 0.970132
C  -0.920634 -4.725988 0.271864
C  4.006791 2.655274 -0.218878
H  -2.687761 0.993422 1.413855
H  -0.348708 0.974937 1.035964
H  -2.890532 2.431528 -0.451478
H  -3.122941 1.118994 -1.581261
H  -0.841375 0.969601 -1.955955
H  -0.572735 2.33591 -0.902874
H  -4.517223 -0.512392 -0.482736
H  -1.547346 -1.176816 -1.697008
H  -2.95546 -1.781394 -0.870409
H  0.788661 -0.713047 -1.228177
H  1.068447 -1.034227 0.478851
H  -1.952306 -1.948977 1.754072
H  -4.002971 -2.092876 1.340972
H  -4.212924 -0.818259 2.548701
H  -5.581282 -1.403261 1.610917
H  -6.286344 0.720845 0.721875
H  -5.179891 1.834463 -0.063785
H  -5.072504 1.568813 1.675585
H  0.335071 -2.911046 -1.950832
H  1.936112 1.094567 -2.366093
H  2.280909 0.664608 1.877761
H  3.727754 2.769647 -2.346549
H  4.076839 2.334961 1.905665
H  -1.030614 -5.60334 0.890122
elementType: Cl O N C H
totalener: -1400.16696479 hartree
nucrepener: 2095.71942870 hartree
electener: -3495.88639349 hartree
oneelecener: -6075.28241411 hartree
twoeener: 2579.39602062 hartree
cpcmener: -0.02644545 hartree
kineticenergy: 1395.23138840 hartree
xcener: -114.435614555495 hartree
chargesum: -0.0000000
charge: -0.105920 -0.413447 0.158956 -0.381929 -0.414767 0.494762 -0.132756 0.049631 -0.196702 -0.237052 0.038504 -0.342741 -0.109155 -0.307182 -0.304975 0.020227 0.071195 -0.222399 -0.219704 -0.156236 -0.160187 0.078260 0.099388 0.073260 0.083841 0.088183 0.088156 0.078949 0.082290 0.032725 0.146268 0.169938 0.078604 0.113418 0.225272 0.073640 0.095313 0.093967 0.091508 0.092630 0.087222 0.173164 0.137521 0.140645 0.142159 0.142599 0.162957
qa: -0.1059 -0.4134 0.1590 -0.3819 -0.4148 0.4948 -0.1328 0.0496 -0.1967 -0.2371 0.0385 -0.3427 -0.1092 -0.3072 -0.3050 0.0202 0.0712 -0.2224 -0.2197 -0.1562 -0.1602 0.0783 0.0994 0.0733 0.0838 0.0882 0.0882 0.0789 0.0823 0.0327 0.1463 0.1699 0.0786 0.1134 0.2253 0.0736 0.0953 0.0940 0.0915 0.0926 0.0872 0.1732 0.1375 0.1406 0.1422 0.1426 0.1630
va: 1.1994 2.0310 3.2912 2.8577 3.0287 3.7168 3.9222 3.6970 3.9658 4.0147 3.8094 3.8611 3.7796 3.9320 3.9365 3.5686 4.0479 3.9687 3.9953 4.0035 3.9956 4.0247 3.8186 1.0278 1.0334 1.0045 1.0036 1.0071 1.0110 1.0219 0.9902 0.9946 1.0112 1.0216 1.0385 1.0217 1.0042 1.0079 1.0059 1.0025 1.0009 0.9934 1.0059 1.0064 1.0061 1.0058 0.9928
dispcorr: -0.026570981 hartree
energy: -1400.193535774897
dipole: -43.48786 41.74098 -1.74688 -5.38616 6.00722 0.62105 1.88709 -2.98987 -1.10279
magnitude: 2.15718 au
magnitude: 5.48313 debye
