program: Orca
programVersion: 4.2.1
elementType: Cl O N N N C C C C C C C C C C C C C C C C C C H H H H H H H H H H H H H H H H H H H H H H H H
charge: 0
multiplicity: 1
keywords: wb97x-d3
keywords: def2-TZVPP
keywords: def2/J RIJCOSX GRIDX6 NOFINALGRIDX
keywords: grid4 nofinalgrid
keywords: scfconv7
keywords: smallprint printgap noloewdin
keywords: NOSOSCF
formula: C18H24ClN3O
InChI: InChI=1/C18H24ClN3O/c1-13(2)17-8-5-15(9-14-3-6-16(19)7-4-14)18(17,23)10-22-12-20-11-21-22/h3-4,6-7,11-13,15,17,23H,5,8-10H2,1-2H3
47 atoms
Cl 5.263895 3.600233 -0.054603
O  -1.675024 -1.225981 1.802936
N  -1.181104 -2.671693 -0.730293
N  -0.704142 -3.372026 0.301719
N  0.166141 -4.129439 -1.608212
C  -1.80646 -0.599389 0.550384
C  -2.922626 0.473136 0.611666
C  -0.580668 0.288403 0.222834
C  -2.588375 1.424748 -0.551651
C  -1.087701 1.247268 -0.850937
C  -4.388101 0.019295 0.6187
C  -2.164005 -1.624223 -0.540298
C  0.749725 -0.392152 -0.102663
C  -4.729674 -0.930053 1.764033
C  -5.307081 1.23896 0.685686
C  1.887526 0.592039 -0.101256
C  -0.657393 -3.138181 -1.863314
C  2.474361 0.993641 1.096864
C  2.367891 1.147511 -1.283469
C  3.508995 1.915823 1.122315
C  3.401163 2.074087 -1.280275
C  0.105708 -4.230493 -0.269742
C  3.965107 2.45055 -0.072629
H  -2.747378 1.006178 1.555823
H  -0.424394 0.866891 1.142377
H  -2.829515 2.456126 -0.295725
H  -3.18991 1.180482 -1.431274
H  -0.934503 0.823494 -1.847695
H  -0.547052 2.193832 -0.835698
H  -4.602957 -0.491409 -0.328374
H  -2.298946 -1.141112 -1.507259
H  -3.10951 -2.107551 -0.290055
H  0.705921 -0.87531 -1.080638
H  0.958173 -1.171393 0.634827
H  -1.178132 -2.050973 1.690615
H  -4.518364 -0.470945 2.732707
H  -5.793102 -1.177468 1.745582
H  -4.178499 -1.867834 1.722674
H  -5.112983 1.829359 1.585142
H  -6.354898 0.933922 0.714876
H  -5.189836 1.898831 -0.174628
H  -0.897849 -2.731285 -2.832997
H  2.126429 0.574499 2.033864
H  1.936591 0.853241 -2.232839
H  3.955696 2.208091 2.063295
H  3.760644 2.491653 -2.211251
H  0.665546 -4.954093 0.301976
elementType: Cl O N C H
totalener: -1400.17087025 hartree
nucrepener: 2107.44644269 hartree
electener: -3507.61731294 hartree
oneelecener: -6098.77862756 hartree
twoeener: 2591.16131462 hartree
cpcmener: -0.02590692 hartree
kineticenergy: 1395.22700596 hartree
xcener: -114.437859997871 hartree
chargesum: -0.0000000
charge: -0.106145 -0.443451 0.145493 -0.381823 -0.403694 0.506810 -0.046531 -0.019978 -0.235337 -0.209301 0.017367 -0.277720 -0.100932 -0.293685 -0.306061 0.022728 0.053034 -0.220731 -0.220774 -0.165947 -0.154624 0.083296 0.102002 0.072244 0.079601 0.085652 0.085562 0.082151 0.087597 0.037404 0.127256 0.151909 0.089625 0.108601 0.223354 0.083108 0.091296 0.078338 0.088278 0.091553 0.091779 0.176573 0.139608 0.136043 0.142348 0.141463 0.164663
qa: -0.1061 -0.4435 0.1455 -0.3818 -0.4037 0.5068 -0.0465 -0.0200 -0.2353 -0.2093 0.0174 -0.2777 -0.1009 -0.2937 -0.3061 0.0227 0.0530 -0.2207 -0.2208 -0.1659 -0.1546 0.0833 0.1020 0.0722 0.0796 0.0857 0.0856 0.0822 0.0876 0.0374 0.1273 0.1519 0.0896 0.1086 0.2234 0.0831 0.0913 0.0783 0.0883 0.0916 0.0918 0.1766 0.1396 0.1360 0.1423 0.1415 0.1647
va: 1.1991 1.9974 3.3280 2.8527 3.0344 3.7070 3.8225 3.8383 3.9958 3.9578 3.8598 3.9895 3.7683 3.9326 3.9306 3.5581 4.0489 3.9948 3.9706 4.0012 4.0022 4.0092 3.8163 1.0285 1.0338 1.0068 1.0037 1.0065 1.0095 1.0101 0.9843 0.9838 1.0079 1.0303 1.0631 1.0054 1.0062 1.0273 1.0011 1.0057 1.0034 0.9922 1.0080 1.0066 1.0063 1.0064 0.9933
dispcorr: -0.026730602 hartree
energy: -1400.197600848337
dipole: -44.58266 42.96239 -1.62027 -4.72589 4.93148 0.20559 2.87357 -3.97661 -1.10304
magnitude: 1.97084 au
magnitude: 5.00949 debye
