program: Orca
programVersion: 4.2.1
elementType: Cl O N N N C C C C C C C C C C C C C C C C C C H H H H H H H H H H H H H H H H H H H H H H H H
charge: 0
multiplicity: 1
keywords: wb97x-d3
keywords: def2-TZVPP
keywords: def2/J RIJCOSX GRIDX6 NOFINALGRIDX
keywords: grid4 nofinalgrid
keywords: scfconv7
keywords: smallprint printgap noloewdin
keywords: NOSOSCF
formula: C18H24ClN3O
InChI: InChI=1/C18H24ClN3O/c1-13(2)17-8-5-15(9-14-3-6-16(19)7-4-14)18(17,23)10-22-12-20-11-21-22/h3-4,6-7,11-13,15,17,23H,5,8-10H2,1-2H3
47 atoms
Cl 5.283653 3.850891 -0.192566
O  -1.361468 -1.201438 1.60853
N  -1.270393 -2.861207 -0.549957
N  -1.790386 -3.710897 0.340232
N  0.012902 -4.609978 -0.625019
C  -1.647331 -0.558043 0.394735
C  -2.829529 0.441594 0.477887
C  -0.479446 0.403528 0.103708
C  -2.55613 1.422207 -0.675876
C  -1.039989 1.358167 -0.949256
C  -4.267414 -0.090876 0.499278
C  -1.880092 -1.570257 -0.763498
C  0.858854 -0.239193 -0.257047
C  -4.506326 -1.181996 1.541402
C  -5.239739 1.063269 0.738182
C  1.978505 0.765015 -0.254174
C  -0.197308 -3.412133 -1.118287
C  2.403146 1.382421 -1.427016
C  2.600418 1.126586 0.939001
C  3.414818 2.332432 -1.419157
C  3.614166 2.07164 0.968516
C  -0.988408 -4.743672 0.263389
C  4.013263 2.669705 -0.216588
H  -2.672601 0.973304 1.425479
H  -0.335387 0.965551 1.034714
H  -2.878815 2.431812 -0.42367
H  -3.121515 1.130927 -1.565183
H  -0.843295 0.975426 -1.954683
H  -0.565975 2.337987 -0.898998
H  -4.506213 -0.507185 -0.486872
H  -1.504561 -1.17884 -1.709107
H  -2.943213 -1.754331 -0.914416
H  0.802265 -0.698208 -1.247146
H  1.087202 -1.034193 0.457114
H  -1.976959 -1.926255 1.762705
H  -3.988843 -2.116119 1.312928
H  -4.204034 -0.858604 2.539816
H  -5.567487 -1.43274 1.589649
H  -5.060781 1.535839 1.707347
H  -6.272423 0.70983 0.731113
H  -5.159557 1.836473 -0.026811
H  0.383763 -2.920232 -1.881428
H  1.944095 1.119868 -2.372629
H  2.296786 0.658634 1.868048
H  3.730763 2.798443 -2.342839
H  4.088062 2.33309 1.905219
H  -1.133902 -5.624863 0.868568
elementType: Cl O N C H
totalener: -1400.16661436 hartree
nucrepener: 2095.09653690 hartree
electener: -3495.26315126 hartree
oneelecener: -6074.04662972 hartree
twoeener: 2578.78347846 hartree
cpcmener: -0.02629310 hartree
kineticenergy: 1395.22999628 hartree
xcener: -114.435182516276 hartree
chargesum: 0.0000000
charge: -0.105925 -0.412189 0.158859 -0.381589 -0.414472 0.494461 -0.136751 0.051386 -0.195522 -0.236893 0.040008 -0.340964 -0.111491 -0.309486 -0.304619 0.017596 0.070995 -0.221800 -0.219870 -0.156511 -0.160575 0.077987 0.100167 0.074342 0.083933 0.087879 0.088092 0.079043 0.082475 0.032702 0.146076 0.168790 0.080428 0.114343 0.225979 0.073935 0.096301 0.094344 0.087150 0.091690 0.092940 0.171074 0.137587 0.140822 0.142152 0.142460 0.162660
qa: -0.1059 -0.4122 0.1589 -0.3816 -0.4145 0.4945 -0.1368 0.0514 -0.1955 -0.2369 0.0400 -0.3410 -0.1115 -0.3095 -0.3046 0.0176 0.0710 -0.2218 -0.2199 -0.1565 -0.1606 0.0780 0.1002 0.0743 0.0839 0.0879 0.0881 0.0790 0.0825 0.0327 0.1461 0.1688 0.0804 0.1143 0.2260 0.0739 0.0963 0.0943 0.0872 0.0917 0.0929 0.1711 0.1376 0.1408 0.1422 0.1425 0.1627
va: 1.1993 2.0320 3.2898 2.8554 3.0294 3.7105 3.9283 3.6948 3.9666 4.0167 3.8078 3.8526 3.7764 3.9271 3.9365 3.5713 4.0503 3.9676 3.9949 4.0036 3.9955 4.0252 3.8181 1.0270 1.0340 1.0044 1.0034 1.0073 1.0111 1.0223 0.9908 0.9960 1.0114 1.0215 1.0357 1.0238 1.0036 1.0082 1.0010 1.0059 1.0025 0.9947 1.0058 1.0063 1.0062 1.0059 0.9929
dispcorr: -0.026571142 hartree
energy: -1400.193185497948
dipole: -43.35281 41.60980 -1.74301 -5.43606 6.12201 0.68595 1.90572 -2.96851 -1.06279
magnitude: 2.15363 au
magnitude: 5.47410 debye
