program: Orca
programVersion: 4.2.1
elementType: Cl O N N N C C C C C C C C C C C C C C C C C C H H H H H H H H H H H H H H H H H H H H H H H H
charge: 0
multiplicity: 1
keywords: wb97x-d3
keywords: def2-TZVPP
keywords: def2/J RIJCOSX GRIDX6 NOFINALGRIDX
keywords: grid4 nofinalgrid
keywords: scfconv7
keywords: smallprint printgap noloewdin
keywords: NOSOSCF
formula: C18H24ClN3O
InChI: InChI=1/C18H24ClN3O/c1-13(2)17-8-5-15(9-14-3-6-16(19)7-4-14)18(17,23)10-22-12-20-11-21-22/h3-4,6-7,11-13,15,17,23H,5,8-10H2,1-2H3
47 atoms
Cl 5.021409 1.408807 1.755039
O  -0.8362 -0.025745 1.13341
N  -0.613623 -2.10894 -0.807966
N  -0.099939 -2.40101 -2.006489
N  1.017741 -3.48708 -0.401814
C  -1.64513 0.071017 -0.015681
C  -3.044685 0.620767 0.361599
C  -1.176966 1.176243 -0.987831
C  -3.608102 1.120894 -0.983131
C  -2.391602 1.402452 -1.88433
C  -4.02571 -0.266122 1.1383
C  -1.820086 -1.318297 -0.665671
C  0.134463 1.00816 -1.756468
C  -3.452151 -0.821298 2.438936
C  -5.298447 0.522918 1.442015
C  1.364075 1.095316 -0.889432
C  0.058604 -2.771804 0.138377
C  2.218173 0.010894 -0.713356
C  1.678303 2.285366 -0.23024
C  3.341877 0.093935 0.099167
C  2.796545 2.39092 0.579004
C  0.87607 -3.225399 -1.715484
C  3.620845 1.286659 0.741602
H  -2.838778 1.494564 0.993643
H  -1.070371 2.069017 -0.358499
H  -4.22044 2.011517 -0.844807
H  -4.259979 0.366061 -1.431139
H  -2.370214 0.728179 -2.744949
H  -2.39463 2.414655 -2.290375
H  -4.320631 -1.111524 0.504623
H  -2.25874 -1.244549 -1.659236
H  -2.508352 -1.912955 -0.066891
H  0.177574 1.816055 -2.493679
H  0.138051 0.079967 -2.33051
H  0.092185 0.01388 0.878806
H  -2.609904 -1.493839 2.281978
H  -3.11117 -0.018666 3.096784
H  -4.216126 -1.384492 2.979087
H  -5.079465 1.409637 2.042824
H  -6.007483 -0.086487 2.005618
H  -5.809886 0.854512 0.537544
H  -0.188315 -2.718934 1.186699
H  2.023353 -0.917364 -1.233373
H  1.044151 3.155285 -0.354209
H  3.988337 -0.76487 0.21971
H  3.023518 3.325606 1.073998
H  1.50667 -3.653798 -2.479133
elementType: Cl O N C H
totalener: -1400.16455936 hartree
nucrepener: 2174.96435515 hartree
electener: -3575.12891451 hartree
oneelecener: -6233.79581758 hartree
twoeener: 2658.66690307 hartree
cpcmener: -0.02254455 hartree
kineticenergy: 1395.22000466 hartree
xcener: -114.435135279058 hartree
chargesum: 0.0000000
charge: -0.101263 -0.418234 0.145658 -0.354308 -0.397069 0.462812 -0.080787 0.004023 -0.208478 -0.213614 0.020411 -0.330009 -0.175457 -0.292432 -0.305312 -0.013971 0.044289 -0.225831 -0.191820 -0.158538 -0.154807 0.051910 0.108963 0.070656 0.097238 0.087116 0.088280 0.084207 0.084590 0.033431 0.141542 0.164337 0.112864 0.107818 0.234782 0.083790 0.083345 0.091581 0.088065 0.091761 0.093162 0.169917 0.192085 0.137783 0.138336 0.143890 0.163286
qa: -0.1013 -0.4182 0.1457 -0.3543 -0.3971 0.4628 -0.0808 0.0040 -0.2085 -0.2136 0.0204 -0.3300 -0.1755 -0.2924 -0.3053 -0.0140 0.0443 -0.2258 -0.1918 -0.1585 -0.1548 0.0519 0.1090 0.0707 0.0972 0.0871 0.0883 0.0842 0.0846 0.0334 0.1415 0.1643 0.1129 0.1078 0.2348 0.0838 0.0833 0.0916 0.0881 0.0918 0.0932 0.1699 0.1921 0.1378 0.1383 0.1439 0.1633
va: 1.2038 2.0291 3.3075 2.8371 3.0274 3.7480 3.8452 3.8154 3.9431 3.9800 3.8612 3.8959 3.7863 3.9419 3.9292 3.5654 4.0739 3.9053 4.0055 4.0471 3.9855 4.0353 3.8237 1.0347 1.0152 1.0056 1.0040 1.0055 1.0143 1.0154 1.0046 0.9858 1.0053 1.0238 1.0280 1.0113 1.0065 1.0062 1.0008 1.0060 1.0022 1.0071 0.9736 1.0043 1.0126 1.0056 0.9967
dispcorr: -0.028956060 hartree
energy: -1400.193515421003
dipole: -45.64137 43.68832 -1.95305 2.33458 -1.25830 1.07628 -2.80898 2.12974 -0.67925
magnitude: 2.33113 au
magnitude: 5.92526 debye
