program: Orca
programVersion: 4.2.1
elementType: Cl O N N N C C C C C C C C C C C C C C C C C C H H H H H H H H H H H H H H H H H H H H H H H H
charge: 0
multiplicity: 1
keywords: wb97x-d3
keywords: def2-TZVPP
keywords: def2/J RIJCOSX GRIDX6 NOFINALGRIDX
keywords: grid4 nofinalgrid
keywords: scfconv7
keywords: smallprint printgap noloewdin
keywords: NOSOSCF
formula: C18H24ClN3O
InChI: InChI=1/C18H24ClN3O/c1-13(2)17-8-5-15(9-14-3-6-16(19)7-4-14)18(17,23)10-22-12-20-11-21-22/h3-4,6-7,11-13,15,17,23H,5,8-10H2,1-2H3
47 atoms
Cl 5.170574 3.689518 -0.160542
O  -1.692433 -1.181155 1.812644
N  -1.138117 -2.733916 -0.661054
N  -0.640778 -3.373731 0.400531
N  0.267955 -4.179933 -1.475501
C  -1.788991 -0.620749 0.533835
C  -2.89572 0.46316 0.515193
C  -0.553261 0.240583 0.180122
C  -2.529991 1.352442 -0.689323
C  -1.029896 1.130066 -0.963042
C  -4.364935 0.023409 0.518672
C  -2.13689 -1.696269 -0.511639
C  0.792778 -0.443871 -0.055413
C  -4.736691 -0.862264 1.705659
C  -5.273605 1.253162 0.505574
C  1.909354 0.563125 -0.089844
C  -0.586915 -3.231744 -1.772588
C  2.446641 1.010254 -1.291365
C  2.409027 1.105492 1.090893
C  3.446924 1.970105 -1.324327
C  3.408775 2.063554 1.079722
C  0.202332 -4.227913 -0.133953
C  3.922288 2.493191 -0.133995
H  -2.73313 1.038847 1.435508
H  -0.426384 0.876922 1.065074
H  -2.750691 2.399625 -0.484794
H  -3.132048 1.084532 -1.562374
H  -0.874343 0.634491 -1.92691
H  -0.468353 2.062718 -1.01135
H  -4.567171 -0.532698 -0.406619
H  -2.281323 -1.253017 -1.497565
H  -3.076374 -2.176157 -0.2318
H  0.791046 -1.00009 -0.995199
H  0.985216 -1.167023 0.740886
H  -1.195783 -2.010099 1.755361
H  -4.184291 -1.798813 1.732886
H  -4.537548 -0.350668 2.648711
H  -5.800788 -1.102903 1.677738
H  -6.323777 0.958137 0.509843
H  -5.11629 1.880882 -0.371487
H  -5.103679 1.869828 1.391223
H  -0.833122 -2.877466 -2.761996
H  2.081769 0.600795 -2.225756
H  2.012303 0.769801 2.042086
H  3.854686 2.305391 -2.267988
H  3.789218 2.470776 2.006334
H  0.784745 -4.906596 0.468818
totalener: -1400.14287256 hartree
nucrepener: 2110.86048976 hartree
electener: -3511.00336232 hartree
oneelecener: -6105.54212766 hartree
twoeener: 2594.53876534 hartree
kineticenergy: 1395.24847064 hartree
xcener: -114.439318621876 hartree
chargesum: -0.0000000
charge: -0.086577 -0.374175 0.147382 -0.350166 -0.321813 0.526369 -0.051466 -0.033028 -0.242647 -0.213819 -0.019084 -0.305058 -0.132593 -0.254109 -0.279395 0.047789 0.023111 -0.190897 -0.199535 -0.131148 -0.145023 0.080869 0.096460 0.075860 0.081992 0.087001 0.080187 0.068537 0.095798 0.027910 0.110199 0.141788 0.078865 0.111295 0.200746 0.078146 0.084006 0.083424 0.086381 0.085162 0.085698 0.142482 0.105455 0.121853 0.118682 0.120133 0.136951
qa: -0.0866 -0.3742 0.1474 -0.3502 -0.3218 0.5264 -0.0515 -0.0330 -0.2426 -0.2138 -0.0191 -0.3051 -0.1326 -0.2541 -0.2794 0.0478 0.0231 -0.1909 -0.1995 -0.1311 -0.1450 0.0809 0.0965 0.0759 0.0820 0.0870 0.0802 0.0685 0.0958 0.0279 0.1102 0.1418 0.0789 0.1113 0.2007 0.0781 0.0840 0.0834 0.0864 0.0852 0.0857 0.1425 0.1055 0.1219 0.1187 0.1201 0.1370
va: 1.2199 2.0718 3.3155 2.8495 3.0631 3.6729 3.7996 3.8004 3.9784 3.9558 3.9218 4.0194 3.8038 3.9391 3.9344 3.6107 4.0740 3.9943 4.0201 4.0344 4.0329 4.0207 3.9137 1.0269 1.0331 1.0106 1.0046 1.0091 1.0134 1.0058 0.9861 0.9866 1.0091 1.0324 1.0827 1.0317 1.0082 1.0048 1.0084 1.0059 1.0042 1.0008 1.0137 1.0119 1.0131 1.0132 1.0005
dispcorr: -0.026812937 hartree
energy: -1400.169685492343
dipole: -44.12328 42.95939 -1.16389 -5.14896 5.23100 0.08204 2.44720 -3.05714 -0.60995
magnitude: 1.31659 au
magnitude: 3.34651 debye
