program: Orca
programVersion: 4.2.1
elementType: Cl O N N N C C C C C C C C C C C C C C C C C C H H H H H H H H H H H H H H H H H H H H H H H H
charge: 0
multiplicity: 1
keywords: wb97x-d3
keywords: def2-TZVPP
keywords: def2/J RIJCOSX GRIDX6 NOFINALGRIDX
keywords: grid4 nofinalgrid
keywords: scfconv7
keywords: smallprint printgap noloewdin
keywords: NOSOSCF
formula: C18H24ClN3O
InChI: InChI=1/C18H24ClN3O/c1-13(2)17-8-5-15(9-14-3-6-16(19)7-4-14)18(17,23)10-22-12-20-11-21-22/h3-4,6-7,11-13,15,17,23H,5,8-10H2,1-2H3
47 atoms
Cl 6.851982 -0.087716 0.035875
O  -1.640941 -0.060694 -1.686871
N  -3.335617 1.391783 0.2211
N  -4.150092 1.09338 1.238333
N  -5.340211 1.731366 -0.552394
C  -1.358441 -0.049456 -0.304317
C  -1.958163 -1.31139 0.408926
C  0.166107 -0.144406 -0.045161
C  -0.762388 -1.956965 1.136608
C  0.262778 -0.847079 1.29847
C  -2.729614 -2.313648 -0.464651
C  -1.901139 1.251977 0.312259
C  0.965017 1.154588 -0.175167
C  -3.049016 -3.572843 0.342282
C  -4.039895 -1.757267 -1.016573
C  2.442755 0.887155 -0.127425
C  -4.059158 1.760864 -0.834787
C  3.116814 0.431086 -1.257824
C  3.164288 1.039208 1.0525
C  4.469619 0.130556 -1.218838
C  4.518679 0.7432 1.113165
C  -5.334127 1.308877 0.724085
C  5.159867 0.288029 -0.027028
H  -2.659162 -0.965061 1.175564
H  0.545394 -0.843561 -0.80174
H  -0.328027 -2.745124 0.513737
H  -1.05151 -2.417856 2.080588
H  -0.010663 -0.169171 2.11346
H  1.264284 -1.220941 1.512822
H  -2.089762 -2.609562 -1.30365
H  -1.463138 2.11815 -0.187122
H  -1.638258 1.325125 1.366496
H  0.697856 1.849204 0.624086
H  0.723543 1.65234 -1.120049
H  -1.145276 0.650637 -2.10825
H  -2.156731 -4.0962 0.684743
H  -3.651454 -3.332271 1.222324
H  -3.622424 -4.278691 -0.26102
H  -4.556321 -2.517285 -1.606909
H  -3.897741 -0.891647 -1.657959
H  -4.712377 -1.468104 -0.20499
H  -3.619763 2.061961 -1.771668
H  2.580969 0.308398 -2.19161
H  2.66604 1.395313 1.945834
H  4.975993 -0.220137 -2.107842
H  5.062299 0.868111 2.039689
H  -6.232907 1.164523 1.302959
elementType: Cl O N C H
totalener: -1400.15856716 hartree
nucrepener: 2089.49894571 hartree
electener: -3489.65751287 hartree
oneelecener: -6062.71742858 hartree
twoeener: 2573.05991571 hartree
cpcmener: -0.03513591 hartree
kineticenergy: 1395.26635808 hartree
xcener: -114.439690716790 hartree
chargesum: -0.0000000
charge: -0.107566 -0.400054 0.143199 -0.354646 -0.408430 0.373692 -0.069195 -0.026128 -0.195187 -0.210274 0.092777 -0.219626 -0.051430 -0.313538 -0.343500 -0.004340 0.044011 -0.223625 -0.219707 -0.162793 -0.152732 0.051610 0.101146 0.083899 0.076597 0.083710 0.088138 0.079181 0.083128 0.031443 0.136729 0.125171 0.094960 0.098616 0.213594 0.092191 0.089360 0.091766 0.102213 0.097563 0.079468 0.171015 0.144465 0.141860 0.144843 0.144627 0.161801
qa: -0.1076 -0.4001 0.1432 -0.3546 -0.4084 0.3737 -0.0692 -0.0261 -0.1952 -0.2103 0.0928 -0.2196 -0.0514 -0.3135 -0.3435 -0.0043 0.0440 -0.2236 -0.2197 -0.1628 -0.1527 0.0516 0.1011 0.0839 0.0766 0.0837 0.0881 0.0792 0.0831 0.0314 0.1367 0.1252 0.0950 0.0986 0.2136 0.0922 0.0894 0.0918 0.1022 0.0976 0.0795 0.1710 0.1445 0.1419 0.1448 0.1446 0.1618
va: 1.1978 2.0229 3.3397 2.8579 3.0177 3.8409 3.7381 3.8782 3.9979 3.9948 3.7859 3.9107 3.7392 3.9341 3.9115 3.5445 4.0723 3.9848 3.9608 3.9911 3.9861 4.0378 3.8071 1.0378 1.0388 1.0042 1.0091 1.0092 1.0155 1.0281 0.9923 1.0128 1.0107 1.0166 1.0177 1.0044 0.9990 1.0064 1.0074 1.0243 1.0038 1.0051 1.0050 1.0051 1.0055 1.0051 0.9968
dispcorr: -0.027031587 hartree
energy: -1400.185598744091
dipole: -32.19504 33.43579 1.24074 -13.66772 14.30582 0.63810 1.16012 -1.27420 -0.11409
magnitude: 1.39987 au
magnitude: 3.55818 debye
