program: Orca
programVersion: 4.2.1
elementType: Cl O N N N C C C C C C C C C C C C C C C C C C H H H H H H H H H H H H H H H H H H H H H H H H
charge: 0
multiplicity: 1
keywords: wb97x-d3
keywords: def2-TZVPP
keywords: def2/J RIJCOSX GRIDX6 NOFINALGRIDX
keywords: grid4 nofinalgrid
keywords: scfconv7
keywords: smallprint printgap noloewdin
keywords: NOSOSCF
formula: C18H24ClN3O
InChI: InChI=1/C18H24ClN3O/c1-13(2)17-8-5-15(9-14-3-6-16(19)7-4-14)18(17,23)10-22-12-20-11-21-22/h3-4,6-7,11-13,15,17,23H,5,8-10H2,1-2H3
47 atoms
Cl 5.993606 1.642618 -0.28147
O  -2.408754 -1.221706 -1.42501
N  -2.591861 1.478574 -0.151329
N  -2.695948 1.606699 -1.477978
N  -2.283384 3.596199 -0.538291
C  -1.873726 -0.896726 -0.156116
C  -1.826891 -2.172163 0.69686
C  -0.372796 -0.568515 -0.333634
C  -0.703818 -2.98831 0.041736
C  0.23077 -1.95601 -0.624885
C  -3.134052 -2.917992 1.007126
C  -2.719685 0.190972 0.504709
C  0.286485 0.105108 0.879948
C  -3.8279 -3.588798 -0.174786
C  -2.870373 -3.955797 2.097985
C  1.713286 0.490567 0.605786
C  -2.344051 2.668289 0.389907
C  2.773681 -0.171444 1.21632
C  2.009202 1.521453 -0.284877
C  4.092121 0.174701 0.952539
C  3.317576 1.881874 -0.56389
C  -2.500988 2.889565 -1.659259
C  4.351976 1.200125 0.059808
H  -1.456276 -1.841475 1.674517
H  -0.244741 0.097873 -1.192536
H  -1.100253 -3.680025 -0.702686
H  -0.178939 -3.595961 0.779054
H  1.252788 -2.031426 -0.251404
H  0.288408 -2.127388 -1.699285
H  -3.834161 -2.186831 1.428173
H  -2.44012 0.334857 1.547031
H  -3.770883 -0.102368 0.492406
H  0.253771 -0.554024 1.750376
H  -0.261064 1.008788 1.158272
H  -2.443445 -0.402529 -1.940646
H  -3.186117 -4.32879 -0.656839
H  -4.71711 -4.118364 0.173359
H  -4.146402 -2.878775 -0.93321
H  -2.211495 -4.750953 1.742419
H  -3.799846 -4.426578 2.422796
H  -2.402786 -3.508267 2.97737
H  -2.22652 2.8162 1.451757
H  2.573803 -0.972392 1.917516
H  1.207272 2.063775 -0.77224
H  4.900971 -0.352201 1.440075
H  3.525561 2.68498 -1.25779
H  -2.519665 3.328698 -2.644151
elementType: Cl O N C H
totalener: -1400.15764918 hartree
nucrepener: 2115.05562976 hartree
electener: -3515.21327894 hartree
oneelecener: -6114.02091406 hartree
twoeener: 2598.80763513 hartree
cpcmener: -0.03009495 hartree
kineticenergy: 1395.27071226 hartree
xcener: -114.444620979802 hartree
chargesum: -0.0000000
charge: -0.106960 -0.469827 0.141680 -0.388907 -0.414605 0.491957 -0.095635 0.011168 -0.221431 -0.245207 0.039857 -0.208595 -0.138309 -0.313524 -0.311973 0.034439 0.050219 -0.232684 -0.235487 -0.141555 -0.160759 0.078046 0.094175 0.087987 0.084725 0.097358 0.087519 0.093687 0.090608 0.039445 0.125869 0.138765 0.111670 0.109858 0.220074 0.079622 0.093740 0.088117 0.086312 0.095924 0.091647 0.184797 0.143450 0.139071 0.143960 0.144251 0.165460
qa: -0.1070 -0.4698 0.1417 -0.3889 -0.4146 0.4920 -0.0956 0.0112 -0.2214 -0.2452 0.0399 -0.2086 -0.1383 -0.3135 -0.3120 0.0344 0.0502 -0.2327 -0.2355 -0.1416 -0.1608 0.0780 0.0942 0.0880 0.0847 0.0974 0.0875 0.0937 0.0906 0.0394 0.1259 0.1388 0.1117 0.1099 0.2201 0.0796 0.0937 0.0881 0.0863 0.0959 0.0916 0.1848 0.1435 0.1391 0.1440 0.1443 0.1655
va: 1.1982 1.9786 3.3090 2.8487 3.0121 3.6584 3.8614 3.8981 3.9309 4.0158 3.8510 3.9702 3.7205 3.9087 3.9247 3.5331 4.0469 3.9732 3.9983 3.9801 4.0143 4.0091 3.8087 1.0136 1.0270 1.0042 1.0094 1.0100 1.0160 1.0137 0.9925 0.9925 1.0143 1.0158 1.0554 1.0025 1.0035 1.0323 0.9989 1.0039 1.0027 0.9885 1.0055 1.0059 1.0052 1.0061 0.9921
dispcorr: -0.026791523 hartree
energy: -1400.184440700066
dipole: -33.38902 32.52337 -0.86565 -30.22131 29.57810 -0.64322 8.58741 -6.81422 1.77318
magnitude: 2.07539 au
magnitude: 5.27523 debye
