program: Orca
programVersion: 4.2.1
elementType: Cl O N N N C C C C C C C C C C C C C C C C C C H H H H H H H H H H H H H H H H H H H H H H H H
charge: 0
multiplicity: 1
keywords: wb97x-d3
keywords: def2-TZVPP
keywords: def2/J RIJCOSX GRIDX6 NOFINALGRIDX
keywords: grid4 nofinalgrid
keywords: scfconv7
keywords: smallprint printgap noloewdin
keywords: NOSOSCF
formula: C18H24ClN3O
InChI: InChI=1/C18H24ClN3O/c1-13(2)17-8-5-15(9-14-3-6-16(19)7-4-14)18(17,23)10-22-12-20-11-21-22/h3-4,6-7,11-13,15,17,23H,5,8-10H2,1-2H3
47 atoms
Cl 6.201959 0.9103 -0.255562
O  -2.285263 -0.912352 -1.372332
N  -2.745532 1.522102 0.182659
N  -2.93528 1.751384 -1.122018
N  -2.611304 3.681461 -0.03929
C  -1.854107 -0.836742 -0.030747
C  -2.077777 -2.202464 0.706021
C  -0.318996 -0.602093 0.059532
C  -0.682135 -2.742377 1.021447
C  0.141464 -1.47949 1.218986
C  -3.060506 -3.184473 0.055005
C  -2.717335 0.181283 0.736038
C  0.190764 0.840418 0.120196
C  -2.487764 -3.967799 -1.123407
C  -3.586691 -4.161592 1.105237
C  1.690659 0.891391 0.03141
C  -2.551548 2.679425 0.808617
C  2.478148 1.054818 1.166841
C  2.330634 0.736983 -1.196156
C  3.864001 1.062119 1.090205
C  3.713471 0.741621 -1.295235
C  -2.83979 3.0562 -1.20547
C  4.469821 0.903125 -0.14484
H  -2.51774 -1.944337 1.67748
H  0.084626 -1.051504 -0.856234
H  -0.273849 -3.309793 0.18125
H  -0.680054 -3.402507 1.889645
H  -0.095136 -1.006963 2.179006
H  1.216716 -1.660989 1.205712
H  -3.915634 -2.604024 -0.306978
H  -2.369391 0.277875 1.763395
H  -3.742398 -0.194801 0.777101
H  -0.12379 1.31348 1.05319
H  -0.228269 1.424837 -0.702993
H  -2.442084 -0.011132 -1.696171
H  -1.747909 -4.700801 -0.795151
H  -3.281226 -4.52389 -1.626716
H  -2.013782 -3.329039 -1.8661
H  -2.779603 -4.764092 1.528756
H  -4.31318 -4.851737 0.672701
H  -4.077784 -3.641719 1.930003
H  -2.378941 2.74776 1.870865
H  2.00757 1.179546 2.134495
H  1.742639 0.613557 -2.097915
H  4.457539 1.191636 1.984964
H  4.190942 0.623954 -2.258488
H  -2.945754 3.570491 -2.147542
elementType: Cl O N C H
totalener: -1400.15736678 hartree
nucrepener: 2104.62252358 hartree
electener: -3504.77989036 hartree
oneelecener: -6093.21372953 hartree
twoeener: 2588.43383917 hartree
cpcmener: -0.03073499 hartree
kineticenergy: 1395.26091171 hartree
xcener: -114.441724966915 hartree
chargesum: -0.0000000
charge: -0.108980 -0.454064 0.119430 -0.382354 -0.408188 0.338810 -0.014998 0.060749 -0.211063 -0.232938 0.060935 -0.193121 -0.071583 -0.333812 -0.307877 -0.018188 0.060740 -0.203951 -0.213988 -0.164039 -0.177447 0.082720 0.110677 0.081175 0.067200 0.090510 0.084250 0.084957 0.083055 0.029455 0.119684 0.144329 0.093864 0.103300 0.219654 0.078797 0.098242 0.098932 0.083027 0.092514 0.088635 0.183965 0.139593 0.143827 0.143871 0.144773 0.164920
qa: -0.1090 -0.4541 0.1194 -0.3824 -0.4082 0.3388 -0.0150 0.0607 -0.2111 -0.2329 0.0609 -0.1931 -0.0716 -0.3338 -0.3079 -0.0182 0.0607 -0.2040 -0.2140 -0.1640 -0.1774 0.0827 0.1107 0.0812 0.0672 0.0905 0.0842 0.0850 0.0831 0.0295 0.1197 0.1443 0.0939 0.1033 0.2197 0.0788 0.0982 0.0989 0.0830 0.0925 0.0886 0.1840 0.1396 0.1438 0.1439 0.1448 0.1649
va: 1.1960 1.9533 3.3221 2.8622 3.0308 3.8975 3.7720 3.7570 3.9960 3.9820 3.8106 3.9561 3.7556 3.9217 3.9307 3.5831 4.0398 3.9516 3.9733 3.9992 4.0041 4.0092 3.7965 1.0063 1.0442 1.0005 1.0146 1.0057 1.0162 1.0402 0.9977 0.9921 1.0059 1.0145 1.0702 0.9977 1.0034 1.0227 1.0004 1.0031 1.0048 0.9897 1.0066 1.0046 1.0057 1.0057 0.9932
dispcorr: -0.026472095 hartree
energy: -1400.183838872476
dipole: -33.08022 32.11110 -0.96912 -27.66810 27.16129 -0.50682 6.45200 -4.73631 1.71569
magnitude: 2.03462 au
magnitude: 5.17158 debye
