program: Orca
programVersion: 4.2.1
elementType: Cl O N N N C C C C C C C C C C C C C C C C C C H H H H H H H H H H H H H H H H H H H H H H H H
charge: 0
multiplicity: 1
keywords: wb97x-d3
keywords: def2-TZVPP
keywords: def2/J RIJCOSX GRIDX6 NOFINALGRIDX
keywords: grid4 nofinalgrid
keywords: scfconv7
keywords: smallprint printgap noloewdin
keywords: NOSOSCF
formula: C18H24ClN3O
InChI: InChI=1/C18H24ClN3O/c1-13(2)17-8-5-15(9-14-3-6-16(19)7-4-14)18(17,23)10-22-12-20-11-21-22/h3-4,6-7,11-13,15,17,23H,5,8-10H2,1-2H3
47 atoms
Cl 6.840815 -0.062313 -0.002702
O  -1.543895 -0.008958 -1.690667
N  -3.33846 1.388401 0.260107
N  -4.166975 1.000861 1.232769
N  -5.331129 1.824818 -0.497494
C  -1.363917 -0.065053 -0.289936
C  -1.946166 -1.351354 0.410354
C  0.160883 -0.149642 -0.048783
C  -0.728652 -2.02036 1.074079
C  0.284414 -0.904659 1.263606
C  -2.75176 -2.313407 -0.478081
C  -1.903367 1.225982 0.351649
C  0.946728 1.160167 -0.136671
C  -2.981959 -3.643926 0.237816
C  -4.120807 -1.765188 -0.880631
C  2.426389 0.900841 -0.106366
C  -4.046487 1.873664 -0.761253
C  3.093916 0.476483 -1.253245
C  3.157678 1.025879 1.070964
C  4.448003 0.179813 -1.232595
C  4.513666 0.733397 1.113826
C  -5.343344 1.27825 0.731365
C  5.14721 0.309496 -0.042579
H  -2.61644 -1.026243 1.212658
H  0.540284 -0.814245 -0.835511
H  -0.298794 -2.774082 0.406917
H  -0.991466 -2.528056 2.00209
H  0.017581 -0.264497 2.111118
H  1.294039 -1.274002 1.446438
H  -2.171647 -2.521374 -1.383924
H  -1.459668 2.095272 -0.132767
H  -1.64447 1.274098 1.408326
H  0.681201 1.823117 0.69015
H  0.68967 1.685319 -1.060677
H  -2.475525 -0.098402 -1.913428
H  -3.513219 -3.497151 1.181437
H  -3.590501 -4.308601 -0.377889
H  -2.054761 -4.171958 0.456692
H  -4.743973 -1.598644 0.00011
H  -4.643584 -2.476818 -1.521704
H  -4.097934 -0.825045 -1.43488
H  -3.593693 2.274512 -1.654854
H  2.550622 0.375123 -2.185376
H  2.665104 1.356364 1.977352
H  4.948469 -0.147025 -2.133992
H  5.064039 0.835945 2.039208
H  -6.250195 1.085498 1.282766
elementType: Cl O N C H
totalener: -1400.15814478 hartree
nucrepener: 2088.09109307 hartree
electener: -3488.24923786 hartree
oneelecener: -6059.91354375 hartree
twoeener: 2571.66430589 hartree
cpcmener: -0.02977442 hartree
kineticenergy: 1395.25780069 hartree
xcener: -114.438474108808 hartree
chargesum: 0.0000000
charge: -0.107870 -0.433328 0.137203 -0.356459 -0.404972 0.345205 -0.057799 0.024804 -0.197492 -0.211121 0.053980 -0.218346 -0.057041 -0.314765 -0.317469 -0.005298 0.012643 -0.224511 -0.218163 -0.164493 -0.153370 0.062523 0.101536 0.086521 0.064806 0.085759 0.088199 0.079120 0.083484 0.049534 0.141278 0.129833 0.090160 0.106307 0.230491 0.092047 0.092876 0.092004 0.088603 0.105251 0.075194 0.186128 0.143693 0.140140 0.145028 0.144645 0.163502
qa: -0.1079 -0.4333 0.1372 -0.3565 -0.4050 0.3452 -0.0578 0.0248 -0.1975 -0.2111 0.0540 -0.2183 -0.0570 -0.3148 -0.3175 -0.0053 0.0126 -0.2245 -0.2182 -0.1645 -0.1534 0.0625 0.1015 0.0865 0.0648 0.0858 0.0882 0.0791 0.0835 0.0495 0.1413 0.1298 0.0902 0.1063 0.2305 0.0920 0.0929 0.0920 0.0886 0.1053 0.0752 0.1861 0.1437 0.1401 0.1450 0.1446 0.1635
va: 1.1977 2.0004 3.3435 2.8543 3.0185 3.8838 3.7625 3.7212 3.9961 4.0079 3.8011 3.9159 3.7341 3.9366 3.9446 3.5304 4.0643 3.9872 3.9600 3.9916 3.9879 4.0247 3.8066 1.0342 1.0507 1.0039 1.0083 1.0086 1.0163 1.0250 0.9926 1.0106 1.0103 1.0202 1.0265 0.9987 1.0062 1.0044 1.0041 1.0102 1.0169 0.9976 1.0054 1.0058 1.0054 1.0051 0.9961
dispcorr: -0.027046453 hartree
energy: -1400.185191238290
dipole: -33.38305 33.38897 0.00591 -14.73410 14.66627 -0.06783 1.42323 -1.23506 0.18816
magnitude: 0.20011 au
magnitude: 0.50863 debye
