program: Orca
programVersion: 4.2.1
elementType: Cl O N N N C C C C C C C C C C C C C C C C C C H H H H H H H H H H H H H H H H H H H H H H H H
charge: 0
multiplicity: 1
keywords: wb97x-d3
keywords: def2-TZVPP
keywords: def2/J RIJCOSX GRIDX6 NOFINALGRIDX
keywords: grid4 nofinalgrid
keywords: scfconv7
keywords: smallprint printgap noloewdin
keywords: NOSOSCF
formula: C18H24ClN3O
InChI: InChI=1/C18H24ClN3O/c1-13(2)17-8-5-15(9-14-3-6-16(19)7-4-14)18(17,23)10-22-12-20-11-21-22/h3-4,6-7,11-13,15,17,23H,5,8-10H2,1-2H3
47 atoms
Cl 6.822756 -0.212445 0.089202
O  -1.700436 -0.077157 -1.702491
N  -3.356168 1.485314 0.099239
N  -4.126417 1.308317 1.17667
N  -5.393977 1.615399 -0.640513
C  -1.387147 0.037776 -0.332347
C  -2.027329 -1.135405 0.482522
C  0.135354 -0.0953 -0.074409
C  -0.85111 -1.874497 1.136384
C  0.226637 -0.80761 1.268585
C  -3.045307 -2.020044 -0.255476
C  -1.913983 1.390744 0.175179
C  0.96983 1.182017 -0.203788
C  -2.432493 -3.040384 -1.21231
C  -3.933722 -2.737905 0.758959
C  2.441343 0.880688 -0.135682
C  -4.125611 1.666101 -0.976423
C  3.115193 0.387294 -1.250531
C  3.157576 1.036828 1.046938
C  4.458823 0.051284 -1.192905
C  4.50292 0.705697 1.126248
C  -5.337299 1.393425 0.685866
C  5.142614 0.210903 0.002153
H  -2.582468 -0.671849 1.303457
H  0.494368 -0.802839 -0.832945
H  -0.478019 -2.677581 0.496292
H  -1.127087 -2.325772 2.090144
H  -0.001849 -0.121059 2.090788
H  1.21769 -1.221237 1.459171
H  -3.695729 -1.362582 -0.840752
H  -1.49497 2.215018 -0.405858
H  -1.640887 1.555894 1.216751
H  0.708521 1.89153 0.584909
H  0.752155 1.676984 -1.156123
H  -1.186397 0.571879 -2.195852
H  -1.701508 -2.600143 -1.888392
H  -1.942681 -3.855768 -0.675524
H  -3.213034 -3.493835 -1.826887
H  -4.689887 -3.346865 0.259509
H  -4.458278 -2.029774 1.403475
H  -3.354612 -3.404762 1.402201
H  -3.730322 1.838477 -1.963723
H  2.587346 0.261657 -2.188663
H  2.664123 1.423582 1.930283
H  4.962641 -0.328939 -2.071302
H  5.040083 0.834468 2.056182
H  -6.210978 1.29711 1.3116
elementType: Cl O N C H
totalener: -1400.16810259 hartree
nucrepener: 2087.96141832 hartree
electener: -3488.12952091 hartree
oneelecener: -6059.69068957 hartree
twoeener: 2571.56116866 hartree
cpcmener: -0.02964944 hartree
kineticenergy: 1395.23675895 hartree
xcener: -114.432333361500 hartree
chargesum: -0.0000000
charge: -0.104695 -0.385436 0.133103 -0.347827 -0.408661 0.336740 -0.030900 -0.003232 -0.213972 -0.212804 0.053154 -0.206293 -0.064516 -0.331229 -0.304294 0.004854 0.055800 -0.221195 -0.215531 -0.160461 -0.149841 0.056090 0.099736 0.085320 0.078947 0.093853 0.085177 0.081199 0.084529 0.036159 0.133415 0.120697 0.093506 0.098835 0.205578 0.096792 0.080085 0.099428 0.093435 0.085283 0.084585 0.159804 0.141210 0.137525 0.142653 0.142670 0.160724
qa: -0.1047 -0.3854 0.1331 -0.3478 -0.4087 0.3367 -0.0309 -0.0032 -0.2140 -0.2128 0.0532 -0.2063 -0.0645 -0.3312 -0.3043 0.0049 0.0558 -0.2212 -0.2155 -0.1605 -0.1498 0.0561 0.0997 0.0853 0.0789 0.0939 0.0852 0.0812 0.0845 0.0362 0.1334 0.1207 0.0935 0.0988 0.2056 0.0968 0.0801 0.0994 0.0934 0.0853 0.0846 0.1598 0.1412 0.1375 0.1427 0.1427 0.1607
va: 1.2006 2.0340 3.3456 2.8671 3.0240 3.8861 3.7401 3.8420 4.0036 3.9786 3.7890 3.9277 3.7434 3.9258 3.9264 3.5527 4.0682 3.9877 3.9671 3.9961 3.9909 4.0362 3.8217 1.0299 1.0345 1.0010 1.0138 1.0094 1.0166 1.0246 0.9931 1.0155 1.0119 1.0157 1.0243 1.0225 0.9984 1.0032 1.0034 1.0082 1.0007 1.0119 1.0053 1.0067 1.0060 1.0055 0.9961
dispcorr: -0.026895330 hartree
energy: -1400.194997917193
dipole: -30.92103 32.06159 1.14056 -13.77493 14.41810 0.64318 1.38482 -1.61289 -0.22807
magnitude: 1.32913 au
magnitude: 3.37837 debye
