program: Orca
programVersion: 4.2.1
elementType: Cl O N N N C C C C C C C C C C C C C C C C C C H H H H H H H H H H H H H H H H H H H H H H H H
charge: 0
multiplicity: 1
keywords: wb97x-d3
keywords: def2-TZVPP
keywords: def2/J RIJCOSX GRIDX6 NOFINALGRIDX
keywords: grid4 nofinalgrid
keywords: scfconv7
keywords: smallprint printgap noloewdin
keywords: NOSOSCF
formula: C18H24ClN3O
InChI: InChI=1/C18H24ClN3O/c1-13(2)17-8-5-15(9-14-3-6-16(19)7-4-14)18(17,23)10-22-12-20-11-21-22/h3-4,6-7,11-13,15,17,23H,5,8-10H2,1-2H3
47 atoms
Cl 5.967482 1.698506 -0.324933
O  -2.420713 -1.222172 -1.405793
N  -2.538028 1.480189 -0.118912
N  -2.606786 1.603545 -1.446674
N  -2.24312 3.595447 -0.506124
C  -1.875757 -0.910466 -0.14099
C  -1.84761 -2.191861 0.705777
C  -0.369724 -0.605651 -0.320292
C  -0.726347 -3.018093 0.056312
C  0.201912 -1.998554 -0.638749
C  -3.168475 -2.924007 0.995044
C  -2.699712 0.191962 0.528043
C  0.30991 0.03037 0.903364
C  -3.827955 -3.621144 -0.191275
C  -2.949417 -3.933986 2.120859
C  1.725816 0.444354 0.613203
C  -2.323843 2.676009 0.428799
C  2.810451 -0.251523 1.137296
C  1.986177 1.539568 -0.209222
C  4.116989 0.124399 0.855496
C  3.28186 1.931559 -0.503102
C  -2.420579 2.887081 -1.63445
C  4.341265 1.215697 0.034082
H  -1.483483 -1.870139 1.689044
H  -0.233558 0.075198 -1.166778
H  -1.125521 -3.72523 -0.671639
H  -0.195187 -3.610531 0.802057
H  1.236786 -2.092541 -0.306682
H  0.213631 -2.164744 -1.715569
H  -3.877827 -2.178137 1.372966
H  -2.422531 0.320745 1.573357
H  -3.758045 -0.075968 0.506213
H  0.303201 -0.660824 1.749562
H  -0.241684 0.915821 1.227683
H  -2.452127 -0.402269 -1.920845
H  -3.197836 -4.414552 -0.598375
H  -4.760377 -4.091455 0.128689
H  -4.065938 -2.936346 -1.000713
H  -2.272014 -4.734671 1.815436
H  -3.890324 -4.402618 2.416023
H  -2.524727 -3.464513 3.010765
H  -2.235668 2.827409 1.49331
H  2.641327 -1.102649 1.785897
H  1.165498 2.109719 -0.62938
H  4.945231 -0.430281 1.27564
H  3.460439 2.786898 -1.140801
H  -2.41282 3.323695 -2.620951
elementType: Cl O N C H
totalener: -1400.16905623 hartree
nucrepener: 2115.41176920 hartree
electener: -3515.58082543 hartree
oneelecener: -6114.77700867 hartree
twoeener: 2599.19618324 hartree
cpcmener: -0.02522240 hartree
kineticenergy: 1395.24820628 hartree
xcener: -114.440091819126 hartree
chargesum: -0.0000000
charge: -0.104563 -0.450820 0.145545 -0.383607 -0.407386 0.501373 -0.094563 0.012952 -0.223265 -0.241555 0.032105 -0.225020 -0.146381 -0.310749 -0.306970 0.040133 0.047773 -0.232329 -0.230617 -0.141286 -0.158855 0.076113 0.094179 0.084900 0.085276 0.098091 0.087862 0.092184 0.090100 0.037140 0.123932 0.137862 0.110283 0.105506 0.213347 0.075906 0.093359 0.093628 0.086187 0.094992 0.088978 0.180197 0.141167 0.138985 0.142172 0.141659 0.164079
qa: -0.1046 -0.4508 0.1455 -0.3836 -0.4074 0.5014 -0.0946 0.0130 -0.2233 -0.2416 0.0321 -0.2250 -0.1464 -0.3107 -0.3070 0.0401 0.0478 -0.2323 -0.2306 -0.1413 -0.1589 0.0761 0.0942 0.0849 0.0853 0.0981 0.0879 0.0922 0.0901 0.0371 0.1239 0.1379 0.1103 0.1055 0.2133 0.0759 0.0934 0.0936 0.0862 0.0950 0.0890 0.1802 0.1412 0.1390 0.1422 0.1417 0.1641
va: 1.2006 2.0020 3.3008 2.8512 3.0132 3.6561 3.8581 3.8806 3.9264 4.0217 3.8611 3.9720 3.7328 3.9073 3.9211 3.5333 4.0482 3.9776 3.9974 3.9846 4.0204 4.0096 3.8206 1.0119 1.0282 1.0039 1.0083 1.0111 1.0180 1.0139 0.9917 0.9936 1.0132 1.0161 1.0628 1.0029 1.0032 1.0332 0.9997 1.0040 1.0034 0.9901 1.0054 1.0050 1.0057 1.0069 0.9924
dispcorr: -0.026816247 hartree
energy: -1400.195872477513
dipole: -33.63314 32.75533 -0.87781 -30.58971 29.94335 -0.64636 8.72392 -7.08889 1.63503
magnitude: 1.96511 au
magnitude: 4.99490 debye
