program: Orca
programVersion: 4.2.1
elementType: Cl O N N N C C C C C C C C C C C C C C C C C C H H H H H H H H H H H H H H H H H H H H H H H H
charge: 0
multiplicity: 1
keywords: wb97x-d3
keywords: def2-TZVPP
keywords: def2/J RIJCOSX GRIDX6 NOFINALGRIDX
keywords: grid4 nofinalgrid
keywords: scfconv7
keywords: smallprint printgap noloewdin
keywords: NOSOSCF
formula: C18H24ClN3O
InChI: InChI=1/C18H24ClN3O/c1-13(2)17-8-5-15(9-14-3-6-16(19)7-4-14)18(17,23)10-22-12-20-11-21-22/h3-4,6-7,11-13,15,17,23H,5,8-10H2,1-2H3
47 atoms
Cl 5.936973 1.638932 -0.506195
O  -2.476392 -1.170927 -1.313913
N  -2.550667 1.515349 -0.048218
N  -2.698176 1.629051 -1.370722
N  -2.205361 3.614857 -0.478521
C  -1.891536 -0.877474 -0.064084
C  -1.890703 -2.159081 0.800398
C  -0.387712 -0.578628 -0.266933
C  -0.567814 -2.88336 0.451899
C  0.158463 -1.978617 -0.552232
C  -3.169431 -3.018631 0.751709
C  -2.690332 0.237365 0.622613
C  0.308868 0.061499 0.946734
C  -3.280911 -3.965115 -0.44194
C  -3.297083 -3.822491 2.044333
C  1.721128 0.460492 0.623664
C  -2.257393 2.7078 0.470132
C  2.811344 -0.293721 1.045469
C  1.967654 1.593972 -0.149205
C  4.110071 0.059798 0.70492
C  3.25541 1.964782 -0.499769
C  -2.478968 2.903096 -1.585367
C  4.320516 1.187747 -0.069916
H  -1.808335 -1.808774 1.835527
H  -0.252719 0.089164 -1.124532
H  -0.726332 -3.879962 0.041417
H  0.033373 -3.021634 1.352518
H  1.244755 -2.037545 -0.466966
H  -0.089855 -2.270207 -1.573436
H  -4.025689 -2.335505 0.710991
H  -2.372116 0.383864 1.652958
H  -3.748455 -0.032452 0.647362
H  0.305437 -0.621826 1.799889
H  -0.229722 0.954027 1.270706
H  -2.53966 -0.342794 -1.813478
H  -4.275959 -4.414058 -0.469056
H  -3.120288 -3.464268 -1.393346
H  -2.569112 -4.790315 -0.373968
H  -2.442209 -4.489533 2.184295
H  -4.194901 -4.444196 2.038065
H  -3.354748 -3.173797 2.920854
H  -2.094879 2.866668 1.524928
H  2.65336 -1.175171 1.655405
H  1.140871 2.209319 -0.485661
H  4.943923 -0.541543 1.041493
H  3.423274 2.849268 -1.099449
H  -2.518788 3.330348 -2.575136
elementType: Cl O N C H
totalener: -1400.16849825 hartree
nucrepener: 2118.28604329 hartree
electener: -3518.45454153 hartree
oneelecener: -6120.51630020 hartree
twoeener: 2602.06175867 hartree
cpcmener: -0.02495271 hartree
kineticenergy: 1395.24583632 hartree
xcener: -114.439196555725 hartree
chargesum: -0.0000000
charge: -0.104585 -0.442299 0.143620 -0.383589 -0.408222 0.452793 -0.110300 0.046836 -0.195447 -0.236859 0.017991 -0.209258 -0.178514 -0.316443 -0.298729 0.073889 0.044221 -0.249095 -0.234144 -0.139763 -0.156738 0.082363 0.092437 0.081490 0.087912 0.093175 0.091497 0.093666 0.085531 0.029967 0.117465 0.138274 0.116818 0.109073 0.209913 0.097122 0.101455 0.076629 0.087910 0.091308 0.086232 0.181986 0.143212 0.140101 0.142945 0.141738 0.164417
qa: -0.1046 -0.4423 0.1436 -0.3836 -0.4082 0.4528 -0.1103 0.0468 -0.1954 -0.2369 0.0180 -0.2093 -0.1785 -0.3164 -0.2987 0.0739 0.0442 -0.2491 -0.2341 -0.1398 -0.1567 0.0824 0.0924 0.0815 0.0879 0.0932 0.0915 0.0937 0.0855 0.0300 0.1175 0.1383 0.1168 0.1091 0.2099 0.0971 0.1015 0.0766 0.0879 0.0913 0.0862 0.1820 0.1432 0.1401 0.1429 0.1417 0.1644
va: 1.2005 1.9916 3.2936 2.8576 3.0072 3.7471 3.7932 3.8516 3.8993 3.9985 3.8643 3.9748 3.7631 3.9090 3.9195 3.4750 4.0439 3.9857 3.9996 3.9852 4.0209 4.0038 3.8230 1.0071 1.0252 1.0082 1.0050 1.0117 1.0297 1.0283 0.9978 0.9968 1.0060 1.0191 1.0679 1.0024 1.0248 1.0033 0.9997 1.0038 1.0051 0.9888 1.0045 1.0052 1.0054 1.0069 0.9921
dispcorr: -0.027008525 hartree
energy: -1400.195506771261
dipole: -33.05017 32.20801 -0.84216 -30.65062 30.03245 -0.61817 9.25692 -7.59702 1.65990
magnitude: 1.96128 au
magnitude: 4.98518 debye
