program: Orca
programVersion: 4.2.1
elementType: Cl O N N N C C C C C C C C C C C C C C C C C C H H H H H H H H H H H H H H H H H H H H H H H H
charge: 0
multiplicity: 1
keywords: wb97x-d3
keywords: def2-TZVPP
keywords: def2/J RIJCOSX GRIDX6 NOFINALGRIDX
keywords: grid4 nofinalgrid
keywords: scfconv7
keywords: smallprint printgap noloewdin
keywords: NOSOSCF
formula: C18H24ClN3O
InChI: InChI=1/C18H24ClN3O/c1-13(2)17-8-5-15(9-14-3-6-16(19)7-4-14)18(17,23)10-22-12-20-11-21-22/h3-4,6-7,11-13,15,17,23H,5,8-10H2,1-2H3
47 atoms
Cl 6.668211 -0.496893 0.25403
O  -1.67158 0.100577 -1.711047
N  -3.424671 1.627073 0.138463
N  -4.042494 1.465277 -1.034721
N  -5.527116 1.964388 0.556167
C  -1.506645 0.110695 -0.314419
C  -2.195255 -1.062296 0.439847
C  -0.013275 -0.072916 0.004883
C  -1.301884 -1.301178 1.677909
C  0.00887 -0.52243 1.462411
C  -2.462346 -2.324421 -0.403328
C  -1.99049 1.45908 0.252962
C  0.891712 1.120068 -0.308815
C  -1.223009 -3.025446 -0.950114
C  -3.306394 -3.308711 0.403732
C  2.343652 0.753793 -0.176313
C  -4.32155 1.921194 1.077707
C  2.98981 0.045225 -1.187275
C  3.069622 1.068858 0.968324
C  4.315243 -0.341972 -1.066009
C  4.396994 0.689344 1.110847
C  -5.301402 1.67372 -0.73574
C  5.009202 -0.016782 0.089113
H  -3.187059 -0.742503 0.775606
H  0.323579 -0.906976 -0.618154
H  -1.10225 -2.364351 1.819289
H  -1.801086 -0.970911 2.589724
H  0.060349 0.344468 2.127591
H  0.888171 -1.12788 1.684071
H  -3.070483 -2.014777 -1.259335
H  -1.511381 2.284974 -0.275461
H  -1.746623 1.558568 1.310461
H  0.67205 1.954253 0.362605
H  0.695085 1.469299 -1.326139
H  -2.569156 0.402303 -1.917804
H  -1.500754 -3.970071 -1.423337
H  -0.71156 -2.4323 -1.707188
H  -0.500958 -3.266604 -0.165497
H  -2.762367 -3.712713 1.260965
H  -3.608347 -4.158509 -0.211901
H  -4.217875 -2.841707 0.783805
H  -4.05541 2.09472 2.108606
H  2.453461 -0.210476 -2.093729
H  2.598962 1.624641 1.770442
H  4.797552 -0.888609 -1.865301
H  4.94207 0.946199 2.009276
H  -6.07996 1.616406 -1.48042
elementType: Cl O N C H
totalener: -1400.17120976 hartree
nucrepener: 2093.01329278 hartree
electener: -3493.18450254 hartree
oneelecener: -6069.98413489 hartree
twoeener: 2576.79963235 hartree
cpcmener: -0.02531774 hartree
kineticenergy: 1395.23991544 hartree
xcener: -114.439320093792 hartree
chargesum: -0.0000000
charge: -0.106046 -0.449952 0.125281 -0.384658 -0.409025 0.502356 -0.066630 -0.072470 -0.219155 -0.235489 0.048786 -0.228712 -0.068656 -0.324618 -0.302181 0.026505 0.067751 -0.232061 -0.219648 -0.154633 -0.150673 0.084081 0.093654 0.084509 0.101998 0.094036 0.092726 0.083806 0.083597 0.020820 0.140221 0.124334 0.083735 0.105111 0.220200 0.098192 0.089461 0.088608 0.081326 0.093026 0.089755 0.174417 0.141446 0.135602 0.142702 0.142087 0.164480
qa: -0.1060 -0.4500 0.1253 -0.3847 -0.4090 0.5024 -0.0666 -0.0725 -0.2192 -0.2355 0.0488 -0.2287 -0.0687 -0.3246 -0.3022 0.0265 0.0678 -0.2321 -0.2196 -0.1546 -0.1507 0.0841 0.0937 0.0845 0.1020 0.0940 0.0927 0.0838 0.0836 0.0208 0.1402 0.1243 0.0837 0.1051 0.2202 0.0982 0.0895 0.0886 0.0813 0.0930 0.0898 0.1744 0.1414 0.1356 0.1427 0.1421 0.1645
va: 1.1992 1.9804 3.3468 2.8609 3.0275 3.6015 3.8866 3.8509 3.9759 3.9834 3.8271 3.9969 3.7554 3.9134 3.9339 3.5397 4.0471 3.9940 3.9714 3.9902 3.9960 4.0157 3.8228 1.0053 1.0072 1.0057 1.0078 1.0071 1.0124 1.0369 0.9899 0.9881 1.0096 1.0279 1.0622 1.0065 1.0192 0.9967 1.0045 1.0050 1.0036 0.9920 1.0063 1.0075 1.0055 1.0060 0.9925
dispcorr: -0.026502822 hartree
energy: -1400.197712579688
dipole: -28.69924 28.41889 -0.28035 -13.78031 14.16964 0.38933 3.03392 -1.92781 1.10612
magnitude: 1.20568 au
magnitude: 3.06460 debye
