program: Orca
programVersion: 4.2.1
elementType: Cl O N N N C C C C C C C C C C C C C C C C C C H H H H H H H H H H H H H H H H H H H H H H H H
charge: 0
multiplicity: 1
keywords: wb97x-d3
keywords: def2-TZVPP
keywords: def2/J RIJCOSX GRIDX6 NOFINALGRIDX
keywords: grid4 nofinalgrid
keywords: scfconv7
keywords: smallprint printgap noloewdin
keywords: NOSOSCF
formula: C18H24ClN3O
InChI: InChI=1/C18H24ClN3O/c1-13(2)17-8-5-15(9-14-3-6-16(19)7-4-14)18(17,23)10-22-12-20-11-21-22/h3-4,6-7,11-13,15,17,23H,5,8-10H2,1-2H3
47 atoms
Cl 6.718088 -0.358821 -0.033501
O  -1.691008 0.151215 -1.653936
N  -3.428582 1.548269 0.299352
N  -4.069634 1.443009 -0.867716
N  -5.532988 1.740161 0.791258
C  -1.494602 0.106382 -0.262661
C  -2.112326 -1.11963 0.467194
C  0.010281 -0.079845 0.001729
C  -1.306298 -1.13917 1.775566
C  0.098162 -0.599371 1.440671
C  -2.062153 -2.404039 -0.397125
C  -1.988285 1.423971 0.365392
C  0.888322 1.136019 -0.298238
C  -1.866502 -3.683879 0.409471
C  -3.343154 -2.529908 -1.220402
C  2.350078 0.791933 -0.235899
C  -4.313377 1.720919 1.27985
C  2.96323 0.115005 -1.288541
C  3.121657 1.104403 0.879092
C  4.301387 -0.242077 -1.236599
C  4.462934 0.754906 0.952011
C  -5.329115 1.56287 -0.525118
C  5.042185 0.081376 -0.110107
H  -3.168452 -0.948483 0.703868
H  0.325221 -0.880613 -0.677412
H  -1.276459 -2.122194 2.241296
H  -1.791917 -0.49023 2.507719
H  0.382117 0.198933 2.131226
H  0.864035 -1.369721 1.534029
H  -1.223373 -2.338941 -1.097104
H  -1.549848 2.275114 -0.158066
H  -1.709278 1.508359 1.414638
H  0.68132 1.940396 0.41261
H  0.647653 1.52031 -1.293223
H  -2.587967 0.473308 -1.83049
H  -1.941344 -4.554868 -0.245167
H  -0.887717 -3.733339 0.888289
H  -2.625467 -3.798914 1.187394
H  -3.563094 -1.630805 -1.795064
H  -4.202864 -2.718931 -0.571749
H  -3.279134 -3.35995 -1.926955
H  -4.030055 1.82815 2.315324
H  2.38971 -0.137556 -2.172894
H  2.676021 1.63669 1.710866
H  4.759191 -0.763392 -2.066806
H  5.044936 1.010129 1.827516
H  -6.124524 1.521757 -1.252828
elementType: Cl O N C H
totalener: -1400.16938559 hartree
nucrepener: 2092.12313617 hartree
electener: -3492.29252176 hartree
oneelecener: -6068.15899222 hartree
twoeener: 2575.86647046 hartree
cpcmener: -0.02571063 hartree
kineticenergy: 1395.23607531 hartree
xcener: -114.438065623004 hartree
chargesum: 0.0000000
charge: -0.105717 -0.447590 0.135683 -0.384578 -0.408000 0.528337 -0.036552 -0.092379 -0.213416 -0.223705 0.011068 -0.267598 -0.071797 -0.317707 -0.307220 0.015799 0.071201 -0.223565 -0.207337 -0.158396 -0.160432 0.082349 0.099249 0.083385 0.087916 0.098176 0.092802 0.083744 0.084341 0.038652 0.141254 0.129280 0.082489 0.105320 0.221316 0.093590 0.087935 0.090100 0.084273 0.082471 0.095049 0.173783 0.140720 0.137702 0.141989 0.141611 0.164407
qa: -0.1057 -0.4476 0.1357 -0.3846 -0.4080 0.5283 -0.0366 -0.0924 -0.2134 -0.2237 0.0111 -0.2676 -0.0718 -0.3177 -0.3072 0.0158 0.0712 -0.2236 -0.2073 -0.1584 -0.1604 0.0823 0.0992 0.0834 0.0879 0.0982 0.0928 0.0837 0.0843 0.0387 0.1413 0.1293 0.0825 0.1053 0.2213 0.0936 0.0879 0.0901 0.0843 0.0825 0.0950 0.1738 0.1407 0.1377 0.1420 0.1416 0.1644
va: 1.1998 2.0015 3.3274 2.8654 3.0263 3.6213 3.8737 3.9016 3.9780 3.9180 3.7946 3.9835 3.7612 3.9408 3.9063 3.5579 4.0426 3.9893 3.9676 3.9924 4.0047 4.0166 3.8182 1.0009 1.0195 1.0033 1.0086 1.0093 1.0101 1.0315 0.9946 0.9840 1.0095 1.0280 1.0615 1.0054 0.9987 1.0002 1.0247 1.0026 1.0053 0.9927 1.0066 1.0065 1.0060 1.0065 0.9931
dispcorr: -0.026490940 hartree
energy: -1400.195876530802
dipole: -29.88794 29.71575 -0.17219 -13.81167 14.16697 0.35530 3.36707 -2.20537 1.16170
magnitude: 1.22696 au
magnitude: 3.11869 debye
