program: Orca
programVersion: 4.2.1
elementType: Cl O N N N C C C C C C C C C C C C C C C C C C H H H H H H H H H H H H H H H H H H H H H H H H
charge: 0
multiplicity: 1
keywords: wb97x-d3
keywords: def2-TZVPP
keywords: def2/J RIJCOSX GRIDX6 NOFINALGRIDX
keywords: grid4 nofinalgrid
keywords: scfconv7
keywords: smallprint printgap noloewdin
keywords: NOSOSCF
formula: C18H24ClN3O
InChI: InChI=1/C18H24ClN3O/c1-13(2)17-8-5-15(9-14-3-6-16(19)7-4-14)18(17,23)10-22-12-20-11-21-22/h3-4,6-7,11-13,15,17,23H,5,8-10H2,1-2H3
47 atoms
Cl 5.953471 1.711653 -0.446683
O  -2.441183 -1.196497 -1.404185
N  -2.565883 1.423903 0.029662
N  -2.747719 1.605646 -1.280968
N  -2.345305 3.561137 -0.281488
C  -1.849679 -0.946211 -0.145985
C  -1.767754 -2.297372 0.607789
C  -0.365457 -0.551883 -0.355784
C  -0.416437 -2.912142 0.1551
C  0.247948 -1.887059 -0.76922
C  -2.931258 -3.287055 0.4264
C  -2.658804 0.102485 0.626485
C  0.32661 0.023955 0.893161
C  -2.718179 -4.490054 1.345383
C  -4.318099 -2.710149 0.690091
C  1.736748 0.452568 0.597759
C  -2.330906 2.598245 0.613067
C  2.832317 -0.295422 1.017631
C  1.979495 1.607585 -0.144043
C  4.130949 0.082539 0.704144
C  3.267372 2.003189 -0.467517
C  -2.602351 2.900493 -1.422982
C  4.336905 1.23051 -0.041452
H  -1.708901 -2.06476 1.678402
H  -0.287355 0.191833 -1.15608
H  -0.561784 -3.863451 -0.359808
H  0.213739 -3.127868 1.019723
H  1.336669 -1.895865 -0.697861
H  0.004324 -2.09872 -1.810903
H  -2.908614 -3.64612 -0.607963
H  -2.311181 0.191068 1.654487
H  -3.710623 -0.176228 0.66707
H  0.32842 -0.706138 1.706912
H  -0.220587 0.892166 1.265374
H  -2.543656 -0.345582 -1.856741
H  -2.769964 -4.194351 2.396901
H  -3.488676 -5.246296 1.181888
H  -1.754068 -4.976852 1.190631
H  -4.390554 -2.264628 1.685968
H  -5.070234 -3.50079 0.639946
H  -4.604218 -1.958396 -0.04392
H  -2.158654 2.702908 1.673039
H  2.679736 -1.193389 1.60424
H  1.151031 2.221023 -0.479504
H  4.966634 -0.516979 1.039294
H  3.430778 2.903788 -1.04394
H  -2.685134 3.380137 -2.385827
elementType: Cl O N C H
totalener: -1400.17034571 hartree
nucrepener: 2120.21146523 hartree
electener: -3520.38181094 hartree
oneelecener: -6124.34478548 hartree
twoeener: 2603.96297454 hartree
cpcmener: -0.02510779 hartree
kineticenergy: 1395.23040914 hartree
xcener: -114.436679350605 hartree
chargesum: 0.0000000
charge: -0.104931 -0.452900 0.148458 -0.386238 -0.408777 0.467906 -0.148917 0.046301 -0.178325 -0.238942 0.077647 -0.238007 -0.170698 -0.303565 -0.350246 0.064020 0.045851 -0.245651 -0.229878 -0.138931 -0.158931 0.079852 0.093678 0.079653 0.088937 0.077123 0.092733 0.095747 0.083839 0.032823 0.121608 0.164289 0.116819 0.109206 0.215858 0.082091 0.091667 0.092682 0.088434 0.097340 0.089373 0.181374 0.140348 0.140005 0.143107 0.142105 0.164062
qa: -0.1049 -0.4529 0.1485 -0.3862 -0.4088 0.4679 -0.1489 0.0463 -0.1783 -0.2389 0.0776 -0.2380 -0.1707 -0.3036 -0.3502 0.0640 0.0459 -0.2457 -0.2299 -0.1389 -0.1589 0.0799 0.0937 0.0797 0.0889 0.0771 0.0927 0.0957 0.0838 0.0328 0.1216 0.1643 0.1168 0.1092 0.2159 0.0821 0.0917 0.0927 0.0884 0.0973 0.0894 0.1814 0.1403 0.1400 0.1431 0.1421 0.1641
va: 1.1999 1.9952 3.3000 2.8554 3.0132 3.6863 3.8317 3.8969 3.8945 4.0004 3.8300 3.9375 3.7496 3.9345 3.9377 3.4936 4.0461 3.9849 4.0004 3.9840 4.0190 4.0076 3.8219 1.0140 1.0237 1.0093 1.0029 1.0098 1.0325 1.0265 0.9968 0.9815 1.0047 1.0212 1.0620 1.0013 1.0057 1.0051 0.9971 1.0083 1.0217 0.9895 1.0062 1.0053 1.0052 1.0067 0.9923
dispcorr: -0.027037264 hartree
energy: -1400.197382977412
dipole: -33.47236 32.70309 -0.76927 -29.99797 29.19881 -0.79916 8.89702 -7.33251 1.56451
magnitude: 1.91784 au
magnitude: 4.87476 debye
