program: Gaussian 09
title: 000063474
version: EM64L-G09RevD.01
frameworkgroup: C1[X(C16H12BrFN2O)]
method: RPBEPBE
basis: SDD
operation: Freq
keyword: #p
keyword: freq=noraman
keyword: PBEPBE/SDD
title: #p freq=noraman PBEPBE/SDD
converged: YES YES NO NO
title: Mulliken charges:
elementType: Br F O N N C C C C C C C C C C C C C C C C H H H H H H H H H H H H
charge: 0.028654 -0.199151 -0.229684 -0.360719 -0.024250 0.103035 0.195169 0.121877 -0.469560 0.046451 0.467629 -0.478493 -0.318617 -0.680840 -0.330146 -0.336864 0.335642 -0.350527 -0.164745 -0.172130 -0.230255 0.236731 0.248431 0.297590 0.267319 0.230069 0.231488 0.240348 0.259301 0.260938 0.262649 0.256199 0.256462
chargesum: 0.00000
title: Mulliken charges with hydrogens summed into heavy atoms:
elementType: Br F O N N C C C C C C C C C C C C C C C C
charge: 0.028654 -0.199151 -0.229684 -0.360719 -0.024250 0.103035 0.195169 0.121877 0.015602 0.046451 0.467629 -0.180904 -0.051298 0.021065 -0.070846 -0.075926 0.335642 -0.087877 0.091454 0.084332 -0.230255
polarizability: 3.41475424e+02 -9.78298270e-01 1.74773228e+02 2.69053178e+00 -4.32261424e+00 1.26192932e+02
1716.lowfreq: -7.0317 -5.5020 -0.0004 0.0006 0.0007 4.6801 20.3415 28.5679 32.7566
frequency: 19.8564 28.5399 32.7000 58.5540 77.7726 110.1564 132.0376 149.0375 164.0279 178.1009 199.4579 231.4882 238.5568 266.6223 323.3211 340.2264 358.8406 374.6209 400.1556 411.4705 413.1953 433.5162 481.7508 500.4943 539.2572 558.6399 562.1613 577.3615 623.8382 635.5568 691.8541 697.2287 704.2912 713.8966 745.7233 788.7840 791.3176 822.8212 830.5325 839.6598 845.7995 909.5530 921.6435 940.6368 956.9675 965.2528 971.4063 996.6916 1021.3284 1040.5043 1058.7343 1062.5352 1095.1959 1105.1847 1106.6003 1138.0673 1179.8495 1203.3298 1215.2392 1245.5389 1258.8364 1268.5010 1287.9653 1312.4593 1326.9030 1361.9807 1385.2201 1388.2089 1394.1352 1427.9162 1461.7497 1464.6416 1470.2398 1476.6122 1484.3047 1551.9195 1567.6534 1583.8995 1595.0653 1616.6591 1623.6138 2991.1655 3028.9321 3080.6209 3092.0067 3105.6259 3151.6821 3153.4901 3164.4608 3174.4560 3176.7907 3177.8791 3184.1187
redmass: 4.3743 6.6147 9.4470 3.5596 3.5020 7.2699 7.8791 5.4254 6.1572 6.7995 1.5363 3.0283 6.0506 4.7336 2.8742 6.3061 8.6985 7.6881 6.0405 2.9203 4.8021 4.8134 4.7850 3.5292 6.8145 5.1080 3.9956 5.1964 7.0320 5.5361 5.9342 7.0286 5.0140 4.2842 4.3092 3.5907 1.4804 1.8284 1.2600 1.6625 2.9118 1.4966 3.7043 3.4334 1.3917 1.3441 1.3709 4.7358 3.8674 2.6507 2.3349 1.8506 1.9263 1.3431 1.6961 2.3324 1.1121 2.4332 2.2280 3.3714 1.9886 2.1160 1.2439 1.8479 2.0408 6.5407 1.4513 2.3591 9.8797 4.3882 1.1929 2.4690 2.6478 1.0508 1.0740 9.4808 8.2745 7.9623 6.4623 11.3179 7.7997 1.0344 1.0598 1.1007 1.0999 1.1030 1.0900 1.0896 1.0887 1.0964 1.0932 1.0976 1.0981
irintensity: 0.2333 0.2230 0.2210 0.0857 0.0934 1.4567 0.3555 0.5334 0.2255 3.3867 0.1503 0.7152 0.9578 2.2038 0.6472 9.4388 12.4716 1.2669 5.0745 0.0508 0.5428 3.7628 0.8636 16.1488 0.1926 4.8833 11.1779 14.7872 0.7404 17.7729 5.3319 2.3322 1.6178 3.5931 44.2215 0.9303 27.7048 9.4767 0.0763 54.2794 20.6800 20.3485 24.1943 14.4184 1.5446 0.4658 0.0907 87.3124 2.7673 8.1957 34.1608 31.5875 23.5065 8.8712 24.6237 15.5016 2.0244 15.3917 54.0103 17.0647 58.7683 8.9131 0.0398 32.8873 50.4217 0.3769 9.3419 21.1699 35.0746 10.4145 35.3652 275.8692 53.3255 10.1533 5.1692 216.1558 29.6748 0.0955 31.6947 280.0140 37.4281 29.7795 13.7671 5.0013 30.6745 40.1283 1.5105 5.8988 1.7073 3.9881 4.5148 0.0703 5.7042
temp: 298.150 k
press: 1.00000 atm
elementType: 35 9 8 7 7 6 6 6 6 6 6 6 6 6 6 6 6 6 6 6 6 1 1 1 1 1 1 1 1 1 1 1 1
symmnumber: 1
zpe: 632927.4 jmol-1
zpe.correction: 0.241069 hartree
zpe.thermalcorrener: 0.259283 hartree
zpe.thermalcorrenthalpy: 0.260227 hartree
zpe.thermalcorrgfe: 0.191935 hartree
zpe.sumelectzpe: -913.493120 hartree
zpe.sumelectthermal: -913.474906 hartree
zpe.sumelectthermalent: -913.473962 hartree
zpe.sumelectthermalfe: -913.542255 hartree
dipole: 0.8641 3.9013 -0.3671
dipole: 4.0126
quadrupole: -135.6862 -138.0034 -122.7326
quadrupole: -6.3081 0.7538 1.9479
quadrupole: -3.5455 -5.8627 9.4081 -6.3081 0.7538 1.9479
hfenergy: -913.734189 hartree
pointgroup: C01 [X(C16H12Br1F1N2O1)]
dipole: 0.4587188 -1.5033243 0.1478295 debye
polarizability: 340.2973987|13.8557658|175.9003221|-3.1614209|-4.7357593|126.2438625 unknown
InChI: InChI=1S/C16H12BrFN2O/c1-2-15-19-14-8-5-11(18)9-13(14)16(21)20(15)12-6-3-10(17)4-7-12/h3-9H,2H2,1H3
charge 0 multiplicity 1
33 atoms
Br 6.373938 1.256215 -0.056365
F  -5.344478 2.057123 -0.271532
O  -0.148559 2.053173 -0.266641
N  0.335647 -0.223981 0.092338
N  -1.391788 -1.881745 0.356412
C  -0.109036 -1.554661 0.299695
C  -1.999608 0.495084 -0.023998
C  -0.577498 0.879544 -0.08391
C  0.915953 -2.66665 0.406009
C  -2.357016 -0.873721 0.196223
C  1.75438 0.109375 0.058419
C  -2.998677 1.489463 -0.182334
C  -3.734752 -1.230038 0.255289
C  1.239545 -3.291022 -0.978708
C  2.436431 0.390234 1.262056
C  2.42496 0.191373 -1.180158
C  -4.333655 1.089755 -0.117214
C  -4.728557 -0.252632 0.098672
C  3.807035 0.727964 1.234619
C  3.794587 0.531593 -1.220355
C  4.470183 0.789397 -0.009285
H  1.845587 -2.310755 0.880881
H  0.47075 -3.440513 1.053038
H  -2.711102 2.531354 -0.349005
H  -3.989391 -2.279868 0.423971
H  1.927368 -4.145987 -0.855425
H  1.723644 -2.560334 -1.650107
H  0.315382 -3.653827 -1.460675
H  1.899005 0.355673 2.215198
H  1.8779 0.010819 -2.110811
H  -5.792551 -0.502821 0.139519
H  4.342448 0.945736 2.162744
H  4.319928 0.59978 -2.176759
