program: Orca
programVersion: 4.2.1
elementType: Cl O N N N C C C C C C C C C C C C C C C C C C H H H H H H H H H H H H H H H H H H H H H H H H
charge: 0
multiplicity: 1
keywords: wb97x-d3
keywords: def2-TZVPP
keywords: def2/J RIJCOSX GRIDX6 NOFINALGRIDX
keywords: grid4 nofinalgrid
keywords: scfconv7
keywords: smallprint printgap noloewdin
keywords: NOSOSCF
formula: C18H24ClN3O
InChI: InChI=1/C18H24ClN3O/c1-13(2)17-8-5-15(9-14-3-6-16(19)7-4-14)18(17,23)10-22-12-20-11-21-22/h3-4,6-7,11-13,15,17,23H,5,8-10H2,1-2H3
47 atoms
Cl 3.953217 3.285798 1.254528
O  -2.569857 -0.867992 -1.31617
N  -0.968794 1.216396 0.052524
N  -1.355775 1.609245 -1.16551
N  -0.218617 3.247398 -0.157387
C  -1.507985 -1.1734 -0.447629
C  -1.820159 -2.52607 0.218055
C  -0.261937 -1.515616 -1.305922
C  -1.642461 -3.530429 -0.930933
C  -0.695548 -2.851715 -1.941558
C  -3.100289 -2.673103 1.057672
C  -1.352334 -0.070434 0.601553
C  1.07372 -1.68261 -0.564664
C  -4.422653 -2.519816 0.310837
C  -3.069789 -4.017987 1.78563
C  1.764605 -0.42783 -0.103594
C  -0.294473 2.209435 0.640095
C  2.070305 0.595286 -0.998639
C  2.167681 -0.274681 1.218497
C  2.738671 1.736063 -0.590996
C  2.845713 0.858669 1.645442
C  -0.8794 2.830039 -1.249981
C  3.125128 1.862656 0.734723
H  -1.001723 -2.698093 0.92889
H  -0.129659 -0.75304 -2.079187
H  -2.598344 -3.761287 -1.401498
H  -1.23957 -4.47541 -0.564546
H  0.167701 -3.475752 -2.179733
H  -1.215606 -2.667478 -2.88034
H  -3.071439 -1.897307 1.832805
H  -0.603676 -0.339798 1.346568
H  -2.306857 0.047162 1.12128
H  1.753088 -2.197577 -1.25134
H  0.959835 -2.364707 0.282611
H  -2.37734 -0.00307 -1.708661
H  -4.553121 -1.525561 -0.105793
H  -4.510171 -3.233359 -0.510027
H  -5.253007 -2.713786 0.992701
H  -3.143888 -4.852151 1.08523
H  -3.906586 -4.103765 2.480072
H  -2.150669 -4.149735 2.36046
H  0.13212 2.128035 1.627631
H  1.778206 0.508163 -2.037976
H  1.960028 -1.061648 1.934715
H  2.950943 2.527614 -1.295604
H  3.156661 0.956102 2.676802
H  -1.018451 3.435238 -2.132067
totalener: -1400.13845802 hartree
nucrepener: 2214.50996085 hartree
electener: -3614.64841887 hartree
oneelecener: -6313.24647194 hartree
twoeener: 2698.59805307 hartree
kineticenergy: 1395.25810921 hartree
xcener: -114.445576362608 hartree
chargesum: -0.0000000
charge: -0.075886 -0.399486 0.174532 -0.350728 -0.323070 0.536850 -0.135725 0.038930 -0.214271 -0.192702 -0.001293 -0.322036 -0.258272 -0.259874 -0.282524 0.065622 0.017647 -0.145647 -0.156419 -0.172877 -0.228524 0.060777 0.172240 0.077360 0.073519 0.096632 0.083229 0.072211 0.092670 0.032579 0.122352 0.139571 0.102398 0.109516 0.194729 0.092024 0.074396 0.080038 0.086174 0.088699 0.079180 0.148511 0.115320 0.118386 0.117310 0.122277 0.133659
qa: -0.0759 -0.3995 0.1745 -0.3507 -0.3231 0.5368 -0.1357 0.0389 -0.2143 -0.1927 -0.0013 -0.3220 -0.2583 -0.2599 -0.2825 0.0656 0.0176 -0.1456 -0.1564 -0.1729 -0.2285 0.0608 0.1722 0.0774 0.0735 0.0966 0.0832 0.0722 0.0927 0.0326 0.1224 0.1396 0.1024 0.1095 0.1947 0.0920 0.0744 0.0800 0.0862 0.0887 0.0792 0.1485 0.1153 0.1184 0.1173 0.1223 0.1337
va: 1.2313 2.0670 3.2492 2.8730 3.0361 3.5987 3.9024 3.8651 3.9498 4.0246 3.9183 4.0119 3.8854 3.9212 3.9322 3.5293 4.0695 3.8828 3.8883 4.0376 4.0474 4.0453 3.8169 1.0087 1.0312 1.0098 1.0073 1.0123 1.0199 1.0092 0.9887 0.9911 1.0071 0.9921 1.0878 1.0343 1.0084 1.0034 1.0016 1.0078 1.0044 0.9977 1.0128 1.0082 1.0187 1.0158 1.0018
dispcorr: -0.030455130 hartree
energy: -1400.168913150851
dipole: -29.81964 29.87981 0.06017 -38.31741 37.24995 -1.06746 -1.67036 2.03086 0.36050
magnitude: 1.12830 au
magnitude: 2.86791 debye
