program: Orca
programVersion: 4.2.1
elementType: Cl O N N N C C C C C C C C C C C C C C C C C C H H H H H H H H H H H H H H H H H H H H H H H H
charge: 0
multiplicity: 1
keywords: wb97x-d3
keywords: def2-TZVPP
keywords: def2/J RIJCOSX GRIDX6 NOFINALGRIDX
keywords: grid4 nofinalgrid
keywords: scfconv7
keywords: smallprint printgap noloewdin
keywords: NOSOSCF
formula: C18H24ClN3O
InChI: InChI=1/C18H24ClN3O/c1-13(2)17-8-5-15(9-14-3-6-16(19)7-4-14)18(17,23)10-22-12-20-11-21-22/h3-4,6-7,11-13,15,17,23H,5,8-10H2,1-2H3
47 atoms
Cl 5.92954 1.7660 -0.347369
O  -2.469745 -1.2218 -1.405228
N  -2.557942 1.420376 -0.002337
N  -2.741317 1.595699 -1.313898
N  -2.235041 3.54478 -0.343588
C  -1.868055 -0.954129 -0.164075
C  -1.766845 -2.300272 0.595288
C  -0.38662 -0.551027 -0.377094
C  -0.432617 -2.917638 0.097453
C  0.228777 -1.876885 -0.81336
C  -2.936648 -3.287255 0.457254
C  -2.676045 0.106419 0.601078
C  0.306953 0.003766 0.879939
C  -2.687097 -4.496417 1.359303
C  -4.307891 -2.702863 0.779754
C  1.716105 0.444066 0.601167
C  -2.257899 2.595823 0.560552
C  2.810342 -0.315517 0.997929
C  1.956939 1.627859 -0.091691
C  4.108074 0.081171 0.711574
C  3.244934 2.040717 -0.386974
C  -2.536238 2.88264 -1.474593
C  4.317052 1.259682 0.016553
H  -1.670089 -2.065325 1.664007
H  -0.310617 0.204904 -1.165438
H  -0.606194 -3.848768 -0.443562
H  0.211229 -3.172726 0.941243
H  1.317244 -1.879646 -0.747104
H  -0.024162 -2.071813 -1.854823
H  -2.958132 -3.632403 -0.580636
H  -2.335523 0.196175 1.632419
H  -3.729858 -0.166018 0.629768
H  0.309514 -0.743854 1.678266
H  -0.241803 0.863654 1.269345
H  -2.588276 -0.38043 -1.868791
H  -2.688379 -4.204884 2.412693
H  -3.468163 -5.24675 1.228758
H  -1.733657 -4.984209 1.155945
H  -4.327584 -2.23843 1.769535
H  -5.06267 -3.49078 0.785029
H  -4.623146 -1.968356 0.041283
H  -2.070033 2.713629 1.617105
H  2.652062 -1.237223 1.545356
H  1.122986 2.247056 -0.403507
H  4.948193 -0.521481 1.027844
H  3.415418 2.963944 -0.923235
H  -2.6072 3.355101 -2.441523
totalener: -1400.14299930 hartree
nucrepener: 2123.58044922 hartree
electener: -3523.72344852 hartree
oneelecener: -6131.01789949 hartree
twoeener: 2607.29445096 hartree
kineticenergy: 1395.25248307 hartree
xcener: -114.438525235807 hartree
chargesum: 0.0000000
charge: -0.083908 -0.386103 0.151067 -0.353208 -0.330216 0.450846 -0.151350 0.062139 -0.187966 -0.225493 0.071706 -0.265328 -0.200668 -0.273188 -0.336690 0.083607 0.018622 -0.227561 -0.204962 -0.118902 -0.141365 0.076236 0.088826 0.066065 0.090050 0.075841 0.085825 0.095779 0.090298 0.044853 0.107849 0.153679 0.110266 0.089892 0.194314 0.074316 0.085358 0.087394 0.076979 0.089889 0.096933 0.147523 0.114801 0.126373 0.120414 0.121535 0.137633
qa: -0.0839 -0.3861 0.1511 -0.3532 -0.3302 0.4508 -0.1514 0.0621 -0.1880 -0.2255 0.0717 -0.2653 -0.2007 -0.2732 -0.3367 0.0836 0.0186 -0.2276 -0.2050 -0.1189 -0.1414 0.0762 0.0888 0.0661 0.0901 0.0758 0.0858 0.0958 0.0903 0.0449 0.1078 0.1537 0.1103 0.0899 0.1943 0.0743 0.0854 0.0874 0.0770 0.0899 0.0969 0.1475 0.1148 0.1264 0.1204 0.1215 0.1376
va: 1.2223 2.0677 3.2786 2.8611 3.0424 3.6868 3.8558 3.8709 3.9076 4.0040 3.8492 3.9399 3.7705 3.9337 3.9437 3.5553 4.0700 4.0137 4.0261 4.0198 4.0534 4.0180 3.9195 1.0148 1.0215 1.0125 1.0035 1.0095 1.0342 1.0273 0.9966 0.9911 1.0049 1.0259 1.0828 1.0024 1.0092 1.0080 0.9994 1.0128 1.0199 0.9984 1.0116 1.0098 1.0124 1.0137 0.9992
dispcorr: -0.027165266 hartree
energy: -1400.170164563046
dipole: -33.42264 32.81109 -0.61154 -30.16696 29.54041 -0.62655 8.64572 -7.75304 0.89268
magnitude: 1.25037 au
magnitude: 3.17819 debye
