program: Orca
programVersion: 4.2.1
elementType: Cl O N N N C C C C C C C C C C C C C C C C C C H H H H H H H H H H H H H H H H H H H H H H H H
charge: 0
multiplicity: 1
keywords: wb97x-d3
keywords: def2-TZVPP
keywords: def2/J RIJCOSX GRIDX6 NOFINALGRIDX
keywords: grid4 nofinalgrid
keywords: scfconv7
keywords: smallprint printgap noloewdin
keywords: NOSOSCF
formula: C18H24ClN3O
InChI: InChI=1/C18H24ClN3O/c1-13(2)17-8-5-15(9-14-3-6-16(19)7-4-14)18(17,23)10-22-12-20-11-21-22/h3-4,6-7,11-13,15,17,23H,5,8-10H2,1-2H3
47 atoms
Cl 6.718981 -0.426335 -0.009883
O  -1.659416 0.088377 -1.642488
N  -3.40255 1.580269 0.238363
N  -4.059189 1.349415 -0.902309
N  -5.501499 1.893345 0.71631
C  -1.474395 0.094556 -0.254556
C  -2.14367 -1.084276 0.537688
C  0.029191 -0.07854 0.021737
C  -1.047062 -1.629774 1.478392
C  0.085754 -0.606325 1.446653
C  -2.836982 -2.154296 -0.320912
C  -1.963672 1.444279 0.309573
C  0.911326 1.134672 -0.270879
C  -1.904826 -2.976196 -1.207379
C  -3.656692 -3.080161 0.576232
C  2.371105 0.782943 -0.211308
C  -4.281002 1.90134 1.19399
C  3.135974 1.048061 0.918699
C  2.985418 0.136603 -1.280226
C  4.471092 0.680642 0.990997
C  4.31784 -0.23725 -1.228104
C  -5.314113 1.546715 -0.568749
C  5.054922 0.036732 -0.086636
H  -2.937484 -0.664841 1.165524
H  0.350422 -0.890371 -0.643527
H  -0.666802 -2.586394 1.114627
H  -1.420902 -1.811961 2.486224
H  -0.088619 0.20303 2.165106
H  1.054692 -1.038896 1.69675
H  -3.543854 -1.633893 -0.975372
H  -1.511058 2.268079 -0.245899
H  -1.688649 1.555448 1.359316
H  0.708332 1.936464 0.445624
H  0.666663 1.524929 -1.262479
H  -2.567957 0.362816 -1.835338
H  -2.488391 -3.660746 -1.825539
H  -1.316852 -2.351722 -1.875979
H  -1.219589 -3.592243 -0.621665
H  -4.383402 -2.525139 1.172597
H  -3.019736 -3.638698 1.265943
H  -4.208432 -3.811066 -0.016901
H  -3.991092 2.131279 2.207874
H  2.684315 1.553294 1.76416
H  2.412349 -0.077656 -2.174801
H  5.05213 0.89526 1.877245
H  4.781373 -0.735171 -2.06856
H  -6.116765 1.436359 -1.280578
totalener: -1400.14453001 hartree
nucrepener: 2090.09263560 hartree
electener: -3490.23716561 hartree
oneelecener: -6064.07854287 hartree
twoeener: 2573.84137726 hartree
kineticenergy: 1395.25489821 hartree
xcener: -114.438924347358 hartree
chargesum: -0.0000000
charge: -0.084792 -0.376318 0.126564 -0.355215 -0.328472 0.473180 -0.116338 -0.028490 -0.202044 -0.214136 0.061570 -0.247224 -0.101903 -0.299075 -0.283210 0.032886 0.046918 -0.197672 -0.202467 -0.127459 -0.135412 0.079888 0.089082 0.074232 0.082048 0.096524 0.084333 0.060755 0.087778 0.023047 0.130785 0.101523 0.071996 0.111346 0.199130 0.088528 0.098212 0.074515 0.085632 0.079854 0.088319 0.140204 0.108694 0.125036 0.119584 0.120746 0.137317
qa: -0.0848 -0.3763 0.1266 -0.3552 -0.3285 0.4732 -0.1163 -0.0285 -0.2020 -0.2141 0.0616 -0.2472 -0.1019 -0.2991 -0.2832 0.0329 0.0469 -0.1977 -0.2025 -0.1275 -0.1354 0.0799 0.0891 0.0742 0.0820 0.0965 0.0843 0.0608 0.0878 0.0230 0.1308 0.1015 0.0720 0.1113 0.1991 0.0885 0.0982 0.0745 0.0856 0.0799 0.0883 0.1402 0.1087 0.1250 0.1196 0.1207 0.1373
va: 1.2220 2.0641 3.3277 2.8626 3.0625 3.6753 3.8847 3.7799 3.9675 4.0076 3.8476 4.0130 3.7722 3.9143 3.9452 3.5965 4.0676 3.9884 4.0190 4.0236 4.0187 4.0267 3.9227 1.0073 1.0231 1.0072 1.0107 1.0096 1.0201 1.0373 0.9891 0.9951 1.0071 1.0274 1.0822 1.0091 1.0274 1.0038 1.0053 1.0029 1.0073 1.0005 1.0126 1.0102 1.0126 1.0126 0.9998
dispcorr: -0.026453531 hartree
energy: -1400.170983542924
dipole: -30.57087 30.36711 -0.20376 -13.74619 13.98231 0.23612 3.47801 -2.82142 0.65659
magnitude: 0.72689 au
magnitude: 1.84762 debye
