program: Orca
programVersion: 4.2.1
elementType: Cl Cl Cl S N N N N C C C C C C C C C C C C C C C C C H H H H H H H H H H H H H
charge: 0
multiplicity: 1
keywords: wb97x-d3
keywords: def2-TZVPP
keywords: def2/J RIJCOSX GRIDX6 NOFINALGRIDX
keywords: grid4 nofinalgrid
keywords: scfconv7
keywords: smallprint printgap noloewdin
keywords: NOSOSCF
formula: C17H13Cl3N4S
InChI: InChI=1/C17H13Cl3N4S/c18-13-3-1-12(2-4-13)9-25-17(8-24-11-21-10-22-24)23-16-6-5-14(19)7-15(16)20/h1-7,10-11H,8-9H2
38 atoms
Cl 0.01408 -1.133517 1.004151
Cl -4.27202 -2.199961 1.583488
Cl 3.019246 -4.672614 -1.68829
S  -0.246232 3.011315 -0.535163
N  2.014449 2.613239 1.226274
N  0.433935 0.622526 -1.375476
N  1.411996 2.312541 2.379244
N  2.075531 4.459043 2.367572
C  2.067241 1.678412 0.137754
C  -1.751406 2.402003 -1.349169
C  0.772362 1.591634 -0.63967
C  -2.39115 1.259839 -0.616509
C  -2.76037 1.384232 0.718592
C  -2.626505 0.052214 -1.26248
C  1.108774 -0.588771 -1.404989
C  -3.343146 0.328424 1.400464
C  -3.213686 -1.013858 -0.598533
C  2.39176 3.893487 1.230802
C  0.956167 -1.531983 -0.383845
C  1.866169 -0.951336 -2.517231
C  -3.559928 -0.866531 0.733147
C  1.540854 -2.785881 -0.462686
C  2.460768 -2.196777 -2.611243
C  2.291627 -3.106646 -1.580059
C  1.478736 3.445671 3.024386
H  2.352858 0.701079 0.522447
H  2.854895 1.994859 -0.54824
H  -1.525986 2.140904 -2.381741
H  -2.405671 3.275929 -1.369399
H  -2.584868 2.312614 1.247673
H  -2.341736 -0.06864 -2.299309
H  -3.620853 0.439907 2.439615
H  -3.381877 -1.949005 -1.114703
H  2.896249 4.356457 0.397228
H  1.983567 -0.243028 -3.32631
H  1.409179 -3.497631 0.340308
H  3.044916 -2.44914 -3.484961
H  1.085644 3.546435 4.023814
elementType: Cl S N C H
totalener: -2653.52975240 hartree
nucrepener: 2786.39970146 hartree
electener: -5439.92945386 hartree
oneelecener: -9188.98770376 hartree
twoeener: 3749.05824990 hartree
cpcmener: -0.03285734 hartree
kineticenergy: 2647.26554103 hartree
xcener: -168.243185043296 hartree
chargesum: 0.0000000
charge: -0.077822 -0.109366 -0.095719 -0.079584 0.064858 -0.286604 -0.326511 -0.409749 -0.051373 -0.037368 0.175687 0.094926 -0.228206 -0.206844 0.173124 -0.131320 -0.137267 0.064257 -0.054839 -0.249499 0.080293 -0.079272 -0.095462 0.055746 0.066307 0.142711 0.151786 0.115398 0.152554 0.129020 0.130439 0.144242 0.142668 0.188445 0.146584 0.127491 0.146933 0.163338
qa: -0.0778 -0.1094 -0.0957 -0.0796 0.0649 -0.2866 -0.3265 -0.4097 -0.0514 -0.0374 0.1757 0.0949 -0.2282 -0.2068 0.1731 -0.1313 -0.1373 0.0643 -0.0548 -0.2495 0.0803 -0.0793 -0.0955 0.0557 0.0663 0.1427 0.1518 0.1154 0.1526 0.1290 0.1304 0.1442 0.1427 0.1884 0.1466 0.1275 0.1469 0.1633
va: 1.2482 1.1944 1.2073 2.4002 3.4023 2.9532 2.8735 3.0239 3.8392 3.8262 3.9562 3.5045 4.0252 3.9474 3.6740 3.9456 3.9409 4.0434 3.9733 4.0397 3.7984 3.9908 3.9548 3.8598 4.0459 1.0063 0.9955 1.0346 0.9989 1.0163 1.0133 1.0038 1.0039 0.9887 1.0102 1.0196 1.0023 0.9944
dispcorr: -0.024262674 hartree
energy: -2653.554015077075
dipole: 1.51234 -0.54146 0.97087 20.63184 -19.63086 1.00098 -6.36236 4.15681 -2.20555
magnitude: 2.60941 au
magnitude: 6.63260 debye
