program: Orca
programVersion: 4.2.1
elementType: Cl Cl Cl S N N N N C C C C C C C C C C C C C C C C C H H H H H H H H H H H H H
charge: 0
multiplicity: 1
keywords: wb97x-d3
keywords: def2-TZVPP
keywords: def2/J RIJCOSX GRIDX6 NOFINALGRIDX
keywords: grid4 nofinalgrid
keywords: scfconv7
keywords: smallprint printgap noloewdin
keywords: NOSOSCF
formula: C17H13Cl3N4S
InChI: InChI=1/C17H13Cl3N4S/c18-13-3-1-12(2-4-13)9-25-17(8-24-11-21-10-22-24)23-16-6-5-14(19)7-15(16)20/h1-7,10-11H,8-9H2
38 atoms
Cl 0.480081 0.002525 1.923139
Cl -3.800891 -3.549597 0.558038
Cl -0.019027 -4.178457 -1.393846
S  -0.798565 2.800583 -0.38315
N  2.776111 3.445086 0.993414
N  1.59925 1.411755 -0.455083
N  2.634422 3.399486 2.321557
N  4.684102 2.707705 1.720276
C  1.658788 3.719372 0.137408
C  -1.53278 1.608177 -1.536773
C  0.919634 2.453436 -0.25404
C  -2.083767 0.333361 -0.96299
C  -2.517105 0.218682 0.351907
C  -2.226882 -0.760908 -1.810172
C  1.135323 0.128781 -0.696173
C  -3.048915 -0.970398 0.825327
C  -2.768817 -1.952642 -1.357808
C  3.989408 3.013963 0.652975
C  0.644317 -0.666709 0.341566
C  1.292056 -0.459858 -1.949624
C  -3.163352 -2.050079 -0.034469
C  0.299988 -1.992489 0.13886
C  0.940786 -1.778122 -2.174131
C  0.447752 -2.535097 -1.123778
C  3.802145 2.961378 2.70607
H  2.008663 4.205326 -0.774574
H  1.005766 4.428585 0.643464
H  -0.828532 1.413812 -2.344413
H  -2.345482 2.187246 -1.98374
H  -2.421848 1.051827 1.035474
H  -1.903713 -0.692263 -2.841177
H  -3.364062 -1.049637 1.856609
H  -2.858033 -2.797245 -2.026175
H  4.327226 2.956896 -0.369295
H  1.69262 0.131974 -2.761748
H  -0.086184 -2.584607 0.956144
H  1.053516 -2.204919 -3.160917
H  4.034487 2.825258 3.750526
elementType: Cl S N C H
totalener: -2653.52614209 hartree
nucrepener: 2857.46363576 hartree
electener: -5510.98977785 hartree
oneelecener: -9330.78931663 hartree
twoeener: 3819.79953878 hartree
cpcmener: -0.03470248 hartree
kineticenergy: 2647.25899989 hartree
xcener: -168.247514950713 hartree
chargesum: -0.0000000
charge: -0.082912 -0.104695 -0.099474 -0.076978 0.094499 -0.287107 -0.344995 -0.422615 -0.023533 -0.023717 0.129758 0.067779 -0.237860 -0.203289 0.171885 -0.111015 -0.169506 0.074221 -0.014291 -0.237198 0.105940 -0.094444 -0.106094 0.080964 0.061483 0.146124 0.127119 0.128829 0.160247 0.122787 0.140703 0.140185 0.137603 0.175129 0.149264 0.120219 0.143199 0.161783
qa: -0.0829 -0.1047 -0.0995 -0.0770 0.0945 -0.2871 -0.3450 -0.4226 -0.0235 -0.0237 0.1298 0.0678 -0.2379 -0.2033 0.1719 -0.1110 -0.1695 0.0742 -0.0143 -0.2372 0.1059 -0.0944 -0.1061 0.0810 0.0615 0.1461 0.1271 0.1288 0.1602 0.1228 0.1407 0.1402 0.1376 0.1751 0.1493 0.1202 0.1432 0.1618
va: 1.2419 1.2024 1.2068 2.4053 3.3854 3.0144 2.8876 3.0166 3.8084 3.8231 4.0276 3.5820 3.9253 3.9296 3.7075 3.9508 3.8967 4.0695 3.9722 3.9823 3.7626 3.9293 3.9375 3.7890 4.0592 0.9982 1.0186 1.0156 0.9906 1.0352 1.0017 1.0072 1.0172 0.9973 1.0084 1.0186 1.0038 0.9947
dispcorr: -0.028218038 hartree
energy: -2653.554360132774
dipole: 4.99327 -6.03519 -1.04192 19.71591 -18.02881 1.68710 -8.97312 6.08287 -2.89025
magnitude: 3.50505 au
magnitude: 8.90914 debye
