program: Orca
programVersion: 4.2.1
elementType: Cl Cl Cl S N N N N C C C C C C C C C C C C C C C C C H H H H H H H H H H H H H
charge: 0
multiplicity: 1
keywords: wb97x-d3
keywords: def2-TZVPP
keywords: def2/J RIJCOSX GRIDX6 NOFINALGRIDX
keywords: grid4 nofinalgrid
keywords: scfconv7
keywords: smallprint printgap noloewdin
keywords: NOSOSCF
formula: C17H13Cl3N4S
InChI: InChI=1/C17H13Cl3N4S/c18-13-3-1-12(2-4-13)9-25-17(8-24-11-21-10-22-24)23-16-6-5-14(19)7-15(16)20/h1-7,10-11H,8-9H2
38 atoms
Cl -0.507776 -0.570033 1.362718
Cl -4.194792 -2.949994 0.715314
Cl 3.549697 -3.56324 -0.454999
S  -1.363784 3.289866 -0.370859
N  2.193114 2.138403 0.922891
N  0.133908 1.221925 -0.961276
N  2.680723 1.150157 1.677209
N  4.228854 1.867666 0.219034
C  0.828912 2.580933 1.024295
C  -2.436927 2.351268 -1.500136
C  -0.017597 2.190497 -0.167155
C  -2.882232 1.032012 -0.944964
C  -2.538496 -0.152092 -1.586042
C  -3.646819 0.964957 0.215238
C  0.990879 0.148836 -0.774802
C  -2.942551 -1.380739 -1.087376
C  -4.05774 -0.253723 0.730341
C  3.121063 2.54517 0.054017
C  0.766793 -0.804337 0.22349
C  2.025197 -0.091024 -1.677983
C  -3.695881 -1.418753 0.072706
C  1.543731 -1.945998 0.324922
C  2.824607 -1.214893 -1.579869
C  2.573262 -2.138309 -0.578034
C  3.896451 1.02405 1.216619
H  0.814539 3.666129 1.142167
H  0.396934 2.160717 1.932494
H  -1.930384 2.232804 -2.456579
H  -3.285092 3.020232 -1.659577
H  -1.940849 -0.12234 -2.487169
H  -3.925819 1.872977 0.735419
H  -2.661546 -2.292759 -1.595711
H  -4.651884 -0.291125 1.633041
H  2.950193 3.335722 -0.65984
H  2.206403 0.62454 -2.468762
H  1.346332 -2.668838 1.104175
H  3.62731 -1.368553 -2.287207
H  4.580258 0.296486 1.62401
elementType: Cl S N C H
totalener: -2653.52757386 hartree
nucrepener: 2860.80310894 hartree
electener: -5514.33068280 hartree
oneelecener: -9337.97555781 hartree
twoeener: 3823.64487501 hartree
cpcmener: -0.03072349 hartree
kineticenergy: 2647.25784123 hartree
xcener: -168.245582066790 hartree
chargesum: 0.0000000
charge: -0.087233 -0.108484 -0.099430 -0.074069 0.124424 -0.273636 -0.340357 -0.402296 -0.084289 -0.052693 0.123585 0.082722 -0.198171 -0.231834 0.189941 -0.137912 -0.128251 0.054886 0.017899 -0.277760 0.084924 -0.110343 -0.085806 0.067968 0.075031 0.150565 0.145467 0.120643 0.155049 0.132051 0.133216 0.141763 0.143958 0.179790 0.142798 0.123321 0.144610 0.157952
qa: -0.0872 -0.1085 -0.0994 -0.0741 0.1244 -0.2736 -0.3404 -0.4023 -0.0843 -0.0527 0.1236 0.0827 -0.1982 -0.2318 0.1899 -0.1379 -0.1283 0.0549 0.0179 -0.2778 0.0849 -0.1103 -0.0858 0.0680 0.0750 0.1506 0.1455 0.1206 0.1550 0.1321 0.1332 0.1418 0.1440 0.1798 0.1428 0.1233 0.1446 0.1580
va: 1.2420 1.1956 1.2037 2.4042 3.3454 2.9593 2.8700 3.0137 3.8629 3.8272 4.0167 3.4966 3.9452 4.0241 3.6764 3.9333 3.9436 4.0609 3.8960 3.9908 3.8005 4.0333 3.9371 3.8409 4.0239 1.0022 1.0159 1.0294 0.9982 1.0135 1.0135 1.0049 1.0039 0.9923 1.0149 1.0211 1.0024 0.9977
dispcorr: -0.027624661 hartree
energy: -2653.555198522214
dipole: -0.65280 -0.41354 -1.06634 19.35465 -16.85836 2.49629 -7.13967 6.28816 -0.85151
magnitude: 2.84493 au
magnitude: 7.23124 debye
