program: Orca
programVersion: 4.2.1
elementType: Cl Cl Cl S N N N N C C C C C C C C C C C C C C C C C H H H H H H H H H H H H H
charge: 0
multiplicity: 1
keywords: wb97x-d3
keywords: def2-TZVPP
keywords: def2/J RIJCOSX GRIDX6 NOFINALGRIDX
keywords: grid4 nofinalgrid
keywords: scfconv7
keywords: smallprint printgap noloewdin
keywords: NOSOSCF
formula: C17H13Cl3N4S
InChI: InChI=1/C17H13Cl3N4S/c18-13-3-1-12(2-4-13)9-25-17(8-24-11-21-10-22-24)23-16-6-5-14(19)7-15(16)20/h1-7,10-11H,8-9H2
38 atoms
Cl 0.064352 -0.553227 -1.336457
Cl -4.129298 -1.169693 -2.663068
Cl 2.999216 -4.948121 -0.391407
S  -0.32448 2.456738 1.85097
N  2.0048 2.805683 0.143257
N  0.338551 -0.06945 1.597456
N  2.33551 3.926517 0.791055
N  1.520773 4.401997 -1.24575
C  2.036055 1.520716 0.784049
C  -1.879893 1.579638 2.18555
C  0.7055 1.12135 1.385659
C  -2.447061 0.900721 0.973768
C  -2.700753 1.612794 -0.194129
C  -2.734096 -0.458706 1.000719
C  1.032162 -1.169665 1.112625
C  -3.220968 0.985547 -1.314453
C  -3.261439 -1.10244 -0.108185
C  1.507234 3.107217 -1.057544
C  0.947515 -1.54554 -0.231576
C  1.745845 -1.998837 1.975441
C  -3.493263 -0.372391 -1.260668
C  1.549064 -2.701151 -0.702484
C  2.357467 -3.154286 1.523149
C  2.251496 -3.497977 0.184987
C  2.033888 4.849083 -0.083528
H  2.784272 1.548531 1.576665
H  2.368013 0.77429 0.06429
H  -2.545599 2.366462 2.546358
H  -1.73235 0.87852 3.005232
H  -2.481419 2.672249 -0.24322
H  -2.538356 -1.032611 1.896818
H  -3.40897 1.551161 -2.216727
H  -3.473434 -2.162273 -0.072225
H  1.164357 2.360375 -1.756417
H  1.813454 -1.733399 3.021806
H  1.46818 -2.970139 -1.746518
H  2.906877 -3.778698 2.213674
H  2.197868 5.894708 0.123044
elementType: Cl S N C H
totalener: -2653.52937717 hartree
nucrepener: 2793.15606417 hartree
electener: -5446.68544134 hartree
oneelecener: -9201.68866570 hartree
twoeener: 3755.00322436 hartree
cpcmener: -0.02959559 hartree
kineticenergy: 2647.25682322 hartree
xcener: -168.241666422037 hartree
chargesum: 0.0000000
charge: -0.087377 -0.108334 -0.094495 -0.072609 0.086075 -0.287841 -0.344011 -0.407839 -0.090525 -0.036572 0.166349 0.102332 -0.244838 -0.209916 0.178766 -0.122328 -0.131071 0.086125 -0.044749 -0.244852 0.076360 -0.081891 -0.095378 0.057085 0.071411 0.150101 0.161682 0.153168 0.116672 0.130107 0.129903 0.143580 0.142802 0.161540 0.147721 0.130126 0.147367 0.165352
qa: -0.0874 -0.1083 -0.0945 -0.0726 0.0861 -0.2878 -0.3440 -0.4078 -0.0905 -0.0366 0.1663 0.1023 -0.2448 -0.2099 0.1788 -0.1223 -0.1311 0.0861 -0.0447 -0.2449 0.0764 -0.0819 -0.0954 0.0571 0.0714 0.1501 0.1617 0.1532 0.1167 0.1301 0.1299 0.1436 0.1428 0.1615 0.1477 0.1301 0.1474 0.1654
va: 1.2415 1.1958 1.2085 2.4100 3.3387 2.9653 2.8578 3.0280 3.8579 3.8236 3.9486 3.4865 4.0200 3.9516 3.6712 3.9361 3.9354 4.0537 3.9507 4.0395 3.8005 3.9973 3.9550 3.8641 4.0373 1.0086 0.9871 0.9983 1.0342 1.0172 1.0131 1.0038 1.0039 1.0103 1.0095 1.0177 1.0021 0.9936
dispcorr: -0.024722335 hartree
energy: -2653.554099505656
dipole: 0.20179 0.19877 0.40057 14.92374 -15.50676 -0.58302 13.65422 -12.04911 1.60511
magnitude: 1.75407 au
magnitude: 4.45849 debye
