program: Orca
programVersion: 4.2.1
elementType: Cl Cl Cl S N N N N C C C C C C C C C C C C C C C C C H H H H H H H H H H H H H
charge: 0
multiplicity: 1
keywords: wb97x-d3
keywords: def2-TZVPP
keywords: def2/J RIJCOSX GRIDX6 NOFINALGRIDX
keywords: grid4 nofinalgrid
keywords: scfconv7
keywords: smallprint printgap noloewdin
keywords: NOSOSCF
formula: C17H13Cl3N4S
InChI: InChI=1/C17H13Cl3N4S/c18-13-3-1-12(2-4-13)9-25-17(8-24-11-21-10-22-24)23-16-6-5-14(19)7-15(16)20/h1-7,10-11H,8-9H2
38 atoms
Cl -0.21206 -0.568661 -1.446843
Cl -3.944414 -2.928421 -1.518504
Cl 3.365463 -3.583002 1.17325
S  -1.412205 3.305202 0.137721
N  2.298526 2.128342 -0.562745
N  -0.035988 1.233113 0.959704
N  2.946328 2.574687 0.516452
N  4.14875 0.994282 -0.533278
C  0.978952 2.592113 -0.881505
C  -2.657907 2.34807 1.05334
C  -0.048943 2.205584 0.157125
C  -2.990524 1.035963 0.408911
C  -2.77558 -0.155459 1.091811
C  -3.517869 0.981964 -0.87724
C  0.837088 0.159106 0.942872
C  -3.073981 -1.378549 0.511362
C  -3.819048 -0.231174 -1.475309
C  3.021603 1.185197 -1.16941
C  0.805885 -0.803917 -0.071292
C  1.673595 -0.07965 2.033696
C  -3.589014 -1.403728 -0.772873
C  1.576735 -1.9533 -0.008258
C  2.461384 -1.213151 2.106774
C  2.402015 -2.146635 1.084755
C  4.041695 1.861908 0.491391
H  0.685672 2.182078 -1.848748
H  0.999433 3.677158 -0.996002
H  -3.525222 3.010958 1.07681
H  -2.321713 2.215079 2.080413
H  -2.364173 -0.135358 2.092336
H  -3.693861 1.895525 -1.432095
H  -2.892396 -2.296107 1.05406
H  -4.225731 -0.258083 -2.47709
H  2.697121 0.686937 -2.069806
H  1.699816 0.640919 2.83949
H  1.531816 -2.681009 -0.806628
H  3.105962 -1.366591 2.961142
H  4.806018 1.980343 1.243393
elementType: Cl S N C H
totalener: -2653.52941679 hartree
nucrepener: 2862.83927728 hartree
electener: -5516.36869407 hartree
oneelecener: -9341.78367913 hartree
twoeener: 3825.41498506 hartree
cpcmener: -0.02958594 hartree
kineticenergy: 2647.24953431 hartree
xcener: -168.245013909435 hartree
chargesum: -0.0000000
charge: -0.083278 -0.108258 -0.097854 -0.075792 0.117877 -0.264734 -0.339032 -0.390651 -0.107637 -0.047920 0.148216 0.079759 -0.198898 -0.229529 0.238628 -0.137155 -0.129879 0.070726 -0.069963 -0.275184 0.084706 -0.063419 -0.088375 0.057478 0.056015 0.148219 0.141385 0.153895 0.120302 0.132464 0.133255 0.141625 0.143975 0.168840 0.137076 0.124624 0.146260 0.162234
qa: -0.0833 -0.1083 -0.0979 -0.0758 0.1179 -0.2647 -0.3390 -0.3907 -0.1076 -0.0479 0.1482 0.0798 -0.1989 -0.2295 0.2386 -0.1372 -0.1299 0.0707 -0.0700 -0.2752 0.0847 -0.0634 -0.0884 0.0575 0.0560 0.1482 0.1414 0.1539 0.1203 0.1325 0.1333 0.1416 0.1440 0.1688 0.1371 0.1246 0.1463 0.1622
va: 1.2462 1.1958 1.2059 2.3973 3.3464 2.9654 2.8504 3.0192 3.9109 3.8263 3.9796 3.5022 3.9394 4.0250 3.5704 3.9334 3.9465 4.0614 3.9428 3.9913 3.7975 3.9768 3.9429 3.8606 4.0604 1.0015 1.0093 0.9985 1.0302 1.0124 1.0136 1.0049 1.0041 0.9984 1.0209 1.0196 1.0013 0.9964
dispcorr: -0.027682858 hartree
energy: -2653.557099648373
dipole: -2.08906 0.88340 -1.20566 18.45150 -16.72362 1.72788 5.78157 -5.94229 -0.16072
magnitude: 2.11306 au
magnitude: 5.37097 debye
