program: Orca
programVersion: 4.2.1
elementType: Cl Cl Cl S N N N N C C C C C C C C C C C C C C C C C H H H H H H H H H H H H H
charge: 0
multiplicity: 1
keywords: wb97x-d3
keywords: def2-TZVPP
keywords: def2/J RIJCOSX GRIDX6 NOFINALGRIDX
keywords: grid4 nofinalgrid
keywords: scfconv7
keywords: smallprint printgap noloewdin
keywords: NOSOSCF
formula: C17H13Cl3N4S
InChI: InChI=1/C17H13Cl3N4S/c18-13-3-1-12(2-4-13)9-25-17(8-24-11-21-10-22-24)23-16-6-5-14(19)7-15(16)20/h1-7,10-11H,8-9H2
38 atoms
Cl 0.334463 -1.870754 0.417815
Cl -6.010621 -1.313682 2.061705
Cl 5.529355 -2.392459 -0.807539
S  -1.235904 2.594125 -1.128183
N  1.845746 1.829716 0.960497
N  0.430168 0.545269 -1.291501
N  1.067414 1.210009 1.851086
N  3.231654 0.776486 2.254372
C  1.270653 2.579749 -0.123784
C  -2.313589 1.340103 -1.869865
C  0.265215 1.731478 -0.883902
C  -3.22292 0.687124 -0.868849
C  -2.745815 0.195001 0.34385
C  -4.575548 0.546405 -1.158126
C  1.646674 -0.115735 -1.160675
C  -3.595816 -0.422846 1.245824
C  -5.441059 -0.071999 -0.266332
C  3.12846 1.553433 1.20529
C  1.732993 -1.285054 -0.403692
C  2.788273 0.304866 -1.841293
C  -4.940859 -0.55084 0.931939
C  2.920925 -1.985409 -0.28463
C  3.9831 -0.385738 -1.74243
C  4.041167 -1.522648 -0.953772
C  1.941763 0.58894 2.597775
H  2.072183 2.910193 -0.783637
H  0.795106 3.479714 0.26733
H  -1.669992 0.609314 -2.36154
H  -2.889128 1.842955 -2.646066
H  -1.700257 0.296774 0.604425
H  -4.970648 0.926482 -2.091988
H  -3.21238 -0.796015 2.185659
H  -6.490933 -0.168347 -0.506663
H  3.938613 1.950308 0.614548
H  2.737255 1.186594 -2.467193
H  2.96704 -2.878495 0.32289
H  4.855509 -0.034144 -2.275314
H  1.637937 -0.020533 3.434073
elementType: Cl S N C H
totalener: -2653.52970061 hartree
nucrepener: 2746.73891402 hartree
electener: -5400.26861463 hartree
oneelecener: -9109.84890724 hartree
twoeener: 3709.58029261 hartree
cpcmener: -0.03427075 hartree
kineticenergy: 2647.22739567 hartree
xcener: -168.238621217432 hartree
chargesum: -0.0000000
charge: -0.085360 -0.102952 -0.093888 -0.056963 0.129686 -0.314380 -0.346397 -0.395429 -0.078186 -0.000220 0.155451 -0.013186 -0.163350 -0.209274 0.209811 -0.143689 -0.128878 0.063048 -0.015020 -0.263711 0.092818 -0.114046 -0.106245 0.078642 0.060796 0.149768 0.126148 0.130967 0.135909 0.111443 0.141858 0.136633 0.146171 0.179374 0.153926 0.123403 0.148966 0.156355
qa: -0.0854 -0.1030 -0.0939 -0.0570 0.1297 -0.3144 -0.3464 -0.3954 -0.0782 -0.0002 0.1555 -0.0132 -0.1634 -0.2093 0.2098 -0.1437 -0.1289 0.0630 -0.0150 -0.2637 0.0928 -0.1140 -0.1062 0.0786 0.0608 0.1498 0.1261 0.1310 0.1359 0.1114 0.1419 0.1366 0.1462 0.1794 0.1539 0.1234 0.1490 0.1564
va: 1.2316 1.2019 1.2094 2.4226 3.3095 2.9631 2.8249 3.0149 3.9187 3.7453 3.9689 3.7178 3.9173 3.9949 3.6898 4.0254 3.9496 4.0418 3.9057 3.9985 3.8167 4.0362 3.9400 3.8414 4.0460 0.9919 1.0139 1.0379 1.0089 1.0212 1.0024 1.0114 1.0036 0.9897 0.9990 1.0203 1.0011 0.9992
dispcorr: -0.024996864 hartree
energy: -2653.554697473583
dipole: -1.69783 2.20743 0.50960 16.27885 -13.92586 2.35299 -7.68782 5.42234 -2.26549
magnitude: 3.30586 au
magnitude: 8.40282 debye
