program: Orca
programVersion: 4.2.1
elementType: Cl Cl Cl S N N N N C C C C C C C C C C C C C C C C C H H H H H H H H H H H H H
charge: 0
multiplicity: 1
keywords: wb97x-d3
keywords: def2-TZVPP
keywords: def2/J RIJCOSX GRIDX6 NOFINALGRIDX
keywords: grid4 nofinalgrid
keywords: scfconv7
keywords: smallprint printgap noloewdin
keywords: NOSOSCF
formula: C17H13Cl3N4S
InChI: InChI=1/C17H13Cl3N4S/c18-13-3-1-12(2-4-13)9-25-17(8-24-11-21-10-22-24)23-16-6-5-14(19)7-15(16)20/h1-7,10-11H,8-9H2
38 atoms
Cl -0.862426 -1.834437 0.861701
Cl -5.292766 -2.210751 0.307122
Cl 3.613596 -4.37999 -0.677866
S  -0.512625 2.922732 0.254107
N  2.514922 2.798842 1.003583
N  0.354571 0.528442 -0.391478
N  3.229889 2.752679 -0.12139
N  3.529823 4.70972 0.921525
C  1.651871 1.70512 1.367604
C  -1.67967 2.404647 -1.031784
C  0.553099 1.534446 0.339655
C  -2.55962 1.245553 -0.664203
C  -2.705924 0.184603 -1.549666
C  -3.274113 1.220414 0.527937
C  1.169926 -0.59484 -0.397804
C  -3.549677 -0.876804 -1.265927
C  -4.114859 0.161889 0.834348
C  2.694973 3.973404 1.612608
C  0.687143 -1.804021 0.106767
C  2.434276 -0.585419 -0.983359
C  -4.24596 -0.880101 -0.069513
C  1.431458 -2.968913 0.029057
C  3.190136 -1.741958 -1.074447
C  2.680741 -2.926273 -0.568429
C  3.825355 3.917167 -0.127025
H  1.219888 1.921765 2.344906
H  2.239193 0.792799 1.461974
H  -1.122146 2.201798 -1.945704
H  -2.276608 3.30144 -1.214021
H  -2.147353 0.176355 -2.477057
H  -3.175903 2.030485 1.240468
H  -3.647174 -1.695984 -1.965416
H  -4.662174 0.155317 1.767378
H  2.210703 4.235593 2.540102
H  2.8264 0.344203 -1.374687
H  1.03957 -3.892804 0.431761
H  4.167814 -1.710827 -1.535101
H  4.500251 4.205933 -0.917756
elementType: Cl S N C H
totalener: -2653.54308961 hartree
nucrepener: 2722.35975549 hartree
electener: -5375.90284509 hartree
oneelecener: -9060.67516017 hartree
twoeener: 3684.77231508 hartree
cpcmener: -0.02660078 hartree
kineticenergy: 2647.23390284 hartree
xcener: -168.235539166339 hartree
chargesum: 0.0000000
charge: -0.078357 -0.106178 -0.093251 -0.082982 0.123134 -0.272812 -0.363289 -0.408879 -0.113021 -0.047544 0.174431 0.120306 -0.219724 -0.231353 0.142140 -0.127689 -0.123831 0.075388 -0.018357 -0.225622 0.068089 -0.098891 -0.101470 0.056060 0.082418 0.150265 0.150518 0.117510 0.148979 0.127905 0.128536 0.138411 0.142554 0.181905 0.150689 0.126542 0.145506 0.161961
qa: -0.0784 -0.1062 -0.0933 -0.0830 0.1231 -0.2728 -0.3633 -0.4089 -0.1130 -0.0475 0.1744 0.1203 -0.2197 -0.2314 0.1421 -0.1277 -0.1238 0.0754 -0.0184 -0.2256 0.0681 -0.0989 -0.1015 0.0561 0.0824 0.1503 0.1505 0.1175 0.1490 0.1279 0.1285 0.1384 0.1426 0.1819 0.1507 0.1265 0.1455 0.1620
va: 1.2498 1.1973 1.2092 2.3937 3.3086 2.9835 2.8407 3.0267 3.8973 3.8460 3.9107 3.4930 3.9849 4.0266 3.7519 3.9441 3.9567 4.0354 3.9906 3.9870 3.8094 3.9983 3.9851 3.8671 4.0301 1.0053 0.9928 1.0284 0.9981 1.0097 1.0175 1.0053 1.0042 0.9897 1.0373 1.0191 1.0041 0.9931
dispcorr: -0.023232541 hartree
energy: -2653.566322146589
dipole: 4.42522 -4.45580 -0.03058 22.48490 -21.57786 0.90705 -2.37210 2.85802 0.48592
magnitude: 1.02946 au
magnitude: 2.61668 debye
