program: Orca
programVersion: 4.2.1
elementType: Cl Cl Cl S N N N N C C C C C C C C C C C C C C C C C H H H H H H H H H H H H H
charge: 0
multiplicity: 1
keywords: wb97x-d3
keywords: def2-TZVPP
keywords: def2/J RIJCOSX GRIDX6 NOFINALGRIDX
keywords: grid4 nofinalgrid
keywords: scfconv7
keywords: smallprint printgap noloewdin
keywords: NOSOSCF
formula: C17H13Cl3N4S
InChI: InChI=1/C17H13Cl3N4S/c18-13-3-1-12(2-4-13)9-25-17(8-24-11-21-10-22-24)23-16-6-5-14(19)7-15(16)20/h1-7,10-11H,8-9H2
38 atoms
Cl 1.479033 0.358917 3.087528
Cl -4.612012 -2.540268 -2.667612
Cl 3.738975 -3.608074 0.25805
S  -1.542047 2.961263 0.15143
N  2.21903 2.077726 -0.495902
N  -0.163512 0.794244 0.677008
N  2.688209 2.472741 0.688799
N  4.219086 1.253392 -0.399331
C  0.88656 2.416277 -0.907639
C  -2.772852 1.889759 0.954142
C  -0.170978 1.877664 0.035894
C  -3.240984 0.780536 0.061999
C  -2.933537 -0.544824 0.348475
C  -3.990223 1.060451 -1.078067
C  0.795549 -0.195844 0.54151
C  -3.35347 -1.572701 -0.483781
C  -4.418287 0.04717 -1.919559
C  3.140394 1.349333 -1.134207
C  1.61336 -0.535598 1.620123
C  0.886761 -0.966704 -0.616556
C  -4.08972 -1.265672 -1.615208
C  2.526507 -1.572409 1.537404
C  1.78318 -2.016608 -0.712521
C  2.604237 -2.304969 0.364897
C  3.888347 1.953863 0.705436
H  0.715511 2.014508 -1.907609
H  0.800268 3.501719 -0.986228
H  -3.590111 2.56689 1.208875
H  -2.353421 1.514744 1.88638
H  -2.357324 -0.786496 1.231262
H  -4.24535 2.084984 -1.321886
H  -3.102619 -2.598067 -0.247852
H  -5.000848 0.281138 -2.800331
H  2.979632 0.923955 -2.112468
H  0.234041 -0.745929 -1.451768
H  3.161832 -1.805135 2.380947
H  1.835762 -2.599642 -1.621657
H  4.554156 2.086148 1.5440
elementType: Cl S N C H
totalener: -2653.54208844 hartree
nucrepener: 2768.35552310 hartree
electener: -5421.89761154 hartree
oneelecener: -9152.58156913 hartree
twoeener: 3730.68395759 hartree
cpcmener: -0.02954202 hartree
kineticenergy: 2647.22107225 hartree
xcener: -168.235835655348 hartree
chargesum: 0.0000000
charge: -0.078547 -0.101564 -0.094932 -0.073969 0.111220 -0.283891 -0.331454 -0.388783 -0.092206 -0.041948 0.175317 0.026088 -0.175063 -0.216885 0.233800 -0.143085 -0.133076 0.062221 -0.078878 -0.296133 0.084627 -0.069497 -0.071051 0.057128 0.057703 0.149138 0.134055 0.153671 0.122022 0.137153 0.137649 0.143222 0.143416 0.176138 0.143217 0.120410 0.145039 0.157730
qa: -0.0785 -0.1016 -0.0949 -0.0740 0.1112 -0.2839 -0.3315 -0.3888 -0.0922 -0.0419 0.1753 0.0261 -0.1751 -0.2169 0.2338 -0.1431 -0.1331 0.0622 -0.0789 -0.2961 0.0846 -0.0695 -0.0711 0.0571 0.0577 0.1491 0.1341 0.1537 0.1220 0.1372 0.1376 0.1432 0.1434 0.1761 0.1432 0.1204 0.1450 0.1577
va: 1.2411 1.2040 1.2082 2.3996 3.3538 2.9156 2.8522 3.0226 3.9087 3.8000 3.9704 3.5686 3.9314 4.0162 3.5804 3.9626 3.9638 4.0502 3.9345 3.9946 3.8361 3.9869 3.9196 3.8614 4.0546 0.9931 1.0078 0.9984 1.0363 1.0152 1.0095 1.0053 1.0042 0.9903 1.0084 1.0233 1.0017 0.9994
dispcorr: -0.025305270 hartree
energy: -2653.567393707337
dipole: -6.87160 5.39902 -1.47258 13.89288 -12.71850 1.17438 -4.92297 3.67144 -1.25153
magnitude: 2.26141 au
magnitude: 5.74805 debye
